program: Orca
programVersion: 4.2.1
elementType: Cl Cl O N N C C C C C C C C C C C C C C H H H H H H H H H H H H H H
charge: 0
multiplicity: 1
keywords: wb97x-d3
keywords: def2-TZVPP
keywords: def2/J RIJCOSX GRIDX6 NOFINALGRIDX
keywords: grid4 nofinalgrid
keywords: scfconv7
keywords: smallprint printgap noloewdin
keywords: NOSOSCF
formula: C14H14Cl2N2O
InChI: InChI=1/C14H14Cl2N2O/c1-2-7-19-14(9-18-6-5-17-10-18)12-4-3-11(15)8-13(12)16/h2-6,8,10,14H,1,7,9H2
33 atoms
Cl 0.896263 0.322175 -2.731487
Cl 3.673452 -2.715668 0.682161
O  -1.000585 1.963896 0.878107
N  -2.366112 -0.565679 0.147039
N  -2.310994 -2.550896 1.110581
C  -0.752617 1.251982 -0.307962
C  -2.002252 0.488428 -0.767256
C  0.386815 0.296291 -0.062116
C  1.168736 -0.201263 -1.0998
C  0.650151 -0.183095 1.218345
C  -2.974387 -0.422811 1.364391
C  -1.96875 -1.854235 0.059073
C  -1.580666 3.245075 0.689392
C  2.183101 -1.122415 -0.889474
C  1.651762 -1.106803 1.461021
C  2.412999 -1.566671 0.400289
C  -2.939537 -1.659676 1.9369
C  -0.606489 4.218276 0.105323
C  -0.83879 4.92702 -0.991947
H  -0.484607 1.939205 -1.120255
H  -2.842617 1.173587 -0.882031
H  -1.82704 0.047405 -1.748006
H  0.060533 0.165756 2.054265
H  -3.39046 0.512454 1.698323
H  -1.451016 -2.234856 -0.808298
H  -2.487093 3.195714 0.074133
H  -1.888777 3.572656 1.684381
H  2.77918 -1.481816 -1.716403
H  1.83109 -1.460185 2.466641
H  -3.340563 -1.954265 2.893832
H  0.329889 4.339862 0.64176
H  -0.11847 5.641481 -1.36879
H  -1.760569 4.824034 -1.552863
elementType: Cl O N C H
totalener: -1647.09577705 hartree
nucrepener: 1684.91828346 hartree
electener: -3332.01406051 hartree
oneelecener: -5606.42686123 hartree
twoeener: 2274.41280071 hartree
cpcmener: -0.02811311 hartree
kineticenergy: 1642.60333909 hartree
xcener: -113.422110131687 hartree
chargesum: -0.0000000
charge: -0.082595 -0.087240 -0.376282 -0.015082 -0.391403 0.222664 -0.149408 0.035243 -0.013525 -0.147274 -0.138352 0.030497 0.084972 -0.129014 -0.182449 0.105115 -0.158559 -0.216836 -0.249062 0.102113 0.131565 0.132911 0.142300 0.174759 0.157579 0.084892 0.105310 0.125230 0.148950 0.164674 0.136023 0.134129 0.118157
qa: -0.0826 -0.0872 -0.3763 -0.0151 -0.3914 0.2227 -0.1494 0.0352 -0.0135 -0.1473 -0.1384 0.0305 0.0850 -0.1290 -0.1824 0.1051 -0.1586 -0.2168 -0.2491 0.1021 0.1316 0.1329 0.1423 0.1748 0.1576 0.0849 0.1053 0.1252 0.1489 0.1647 0.1360 0.1341 0.1182
va: 1.2447 1.2161 1.9465 3.2628 3.0927 3.7718 3.8753 3.4832 3.9847 3.9060 3.9085 4.0499 3.9015 4.0663 4.0573 3.8549 4.0462 3.8189 3.9242 1.0256 1.0009 1.0098 1.0239 0.9950 1.0005 0.9963 0.9909 1.0198 1.0034 1.0019 1.0055 1.0012 1.0076
dispcorr: -0.018577867 hartree
energy: -1647.114354915255
dipole: -19.97555 19.31679 -0.65875 20.47652 -17.78242 2.69410 4.98724 -5.89386 -0.90662
magnitude: 2.91789 au
magnitude: 7.41670 debye
