program: Orca
programVersion: 4.2.1
elementType: Cl Cl O N N C C C C C C C C C C C C C C H H H H H H H H H H H H H H
charge: 0
multiplicity: 1
keywords: wb97x-d3
keywords: def2-TZVPP
keywords: def2/J RIJCOSX GRIDX6 NOFINALGRIDX
keywords: grid4 nofinalgrid
keywords: scfconv7
keywords: smallprint printgap noloewdin
keywords: NOSOSCF
formula: C14H14Cl2N2O
InChI: InChI=1/C14H14Cl2N2O/c1-2-7-19-14(9-18-6-5-17-10-18)12-4-3-11(15)8-13(12)16/h2-6,8,10,14H,1,7,9H2
33 atoms
Cl 0.775626 -1.204971 -2.093576
Cl 5.249558 -0.76402 0.80728
O  -1.066329 1.433712 0.895081
N  -2.838129 -0.807181 0.424776
N  -4.707133 -0.830491 -0.747541
C  -0.65074 0.305366 0.169872
C  -1.42336 -0.901213 0.695009
C  0.833161 0.043662 0.316236
C  1.561617 -0.634587 -0.65577
C  1.514876 0.445267 1.460604
C  -3.790803 -0.213698 1.205175
C  -3.436268 -1.13944 -0.739885
C  -0.7084 2.664463 0.301739
C  2.916829 -0.890984 -0.521848
C  2.86793 0.203692 1.626986
C  3.55793 -0.460467 0.626639
C  -4.938147 -0.247726 0.468628
C  -1.59776 3.096459 -0.820875
C  -2.766828 2.564942 -1.153724
H  -0.888213 0.431857 -0.89434
H  -1.04491 -1.81226 0.231908
H  -1.273774 -1.005071 1.769857
H  0.98154 0.967722 2.243326
H  -3.579344 0.155936 2.194154
H  -2.898643 -1.622627 -1.54194
H  -0.740193 3.41609 1.095472
H  0.331079 2.650563 -0.049895
H  3.457122 -1.415305 -1.297642
H  3.372019 0.531697 2.524999
H  -5.914193 0.112237 0.752965
H  -1.21514 3.941949 -1.384276
H  -3.337443 2.959854 -1.983705
H  -3.208391 1.734908 -0.61727
elementType: Cl O N C H
totalener: -1647.09807268 hartree
nucrepener: 1655.59679255 hartree
electener: -3302.69486523 hartree
oneelecener: -5547.21038407 hartree
twoeener: 2244.51551884 hartree
cpcmener: -0.02707430 hartree
kineticenergy: 1642.58711314 hartree
xcener: -113.420771415482 hartree
chargesum: 0.0000000
charge: -0.081611 -0.086145 -0.381944 -0.022901 -0.392922 0.208462 -0.121474 0.015917 -0.027851 -0.186008 -0.138047 0.031255 0.100996 -0.132319 -0.164215 0.099984 -0.152198 -0.189744 -0.276564 0.117126 0.142649 0.136449 0.149039 0.174644 0.156044 0.114152 0.099203 0.125778 0.149177 0.163025 0.137364 0.135591 0.097086
qa: -0.0816 -0.0861 -0.3819 -0.0229 -0.3929 0.2085 -0.1215 0.0159 -0.0279 -0.1860 -0.1380 0.0313 0.1010 -0.1323 -0.1642 0.1000 -0.1522 -0.1897 -0.2766 0.1171 0.1426 0.1364 0.1490 0.1746 0.1560 0.1142 0.0992 0.1258 0.1492 0.1630 0.1374 0.1356 0.0971
va: 1.2489 1.2175 1.9332 3.2676 3.0947 3.7226 3.7993 3.4576 4.0181 3.9884 3.8999 4.0355 3.8726 4.0551 4.0280 3.8543 4.0203 3.8358 3.9442 1.0045 1.0087 1.0075 1.0208 0.9971 1.0055 0.9918 0.9914 1.0200 1.0040 1.0040 0.9982 1.0037 0.9934
dispcorr: -0.018272849 hartree
energy: -1647.116345530634
dipole: -23.18645 25.13666 1.95021 13.04031 -12.39204 0.64827 4.48613 -3.28162 1.20451
magnitude: 2.38210 au
magnitude: 6.05482 debye
