program: Orca
programVersion: 4.2.1
elementType: Cl Cl O N N C C C C C C C C C C C C C C H H H H H H H H H H H H H H
charge: 0
multiplicity: 1
keywords: wb97x-d3
keywords: def2-TZVPP
keywords: def2/J RIJCOSX GRIDX6 NOFINALGRIDX
keywords: grid4 nofinalgrid
keywords: scfconv7
keywords: smallprint printgap noloewdin
keywords: NOSOSCF
formula: C14H14Cl2N2O
InChI: InChI=1/C14H14Cl2N2O/c1-2-7-19-14(9-18-6-5-17-10-18)12-4-3-11(15)8-13(12)16/h2-6,8,10,14H,1,7,9H2
33 atoms
Cl 0.429048 -0.169613 -3.222251
Cl 3.826775 -2.310467 0.312958
O  -1.217093 2.074103 0.199464
N  -2.384322 -0.570945 0.316078
N  -2.759856 -1.04868 2.437074
C  -0.992378 1.133399 -0.813881
C  -2.223012 0.226895 -0.875813
C  0.256733 0.318545 -0.556416
C  0.944136 -0.334378 -1.572966
C  0.711444 0.127281 0.745275
C  -1.860383 -1.816835 0.533857
C  -2.893513 -0.150983 1.495643
C  -0.361388 3.191224 0.157302
C  2.0431 -1.142538 -1.325453
C  1.805052 -0.671641 1.027384
C  2.461444 -1.30207 -0.016326
C  -2.110386 -2.096443 1.843085
C  -0.505704 4.006104 1.395049
C  -1.224545 3.688679 2.46431
H  -0.919143 1.631755 -1.789431
H  -3.11373 0.837792 -1.021996
H  -2.148363 -0.439502 -1.733425
H  0.196286 0.609498 1.565772
H  -1.377416 -2.383571 -0.244758
H  -3.379068 0.805723 1.604101
H  0.691078 2.891948 0.054946
H  -0.583625 3.813672 -0.72077
H  2.556853 -1.635987 -2.138371
H  2.131974 -0.803804 2.049072
H  -1.859423 -2.994666 2.384535
H  0.051299 4.937051 1.379227
H  -1.259818 4.352152 3.318135
H  -1.796324 2.773116 2.540509
elementType: Cl O N C H
totalener: -1647.09729996 hartree
nucrepener: 1693.60006925 hartree
electener: -3340.69736922 hartree
oneelecener: -5623.33518159 hartree
twoeener: 2282.63781237 hartree
cpcmener: -0.02687614 hartree
kineticenergy: 1642.59849851 hartree
xcener: -113.423762415950 hartree
chargesum: -0.0000000
charge: -0.081748 -0.087230 -0.368001 -0.029585 -0.405534 0.224864 -0.099344 -0.020378 -0.014311 -0.110524 -0.135824 0.048213 0.070734 -0.140894 -0.192080 0.111453 -0.150271 -0.174813 -0.314418 0.109807 0.126484 0.125452 0.143972 0.170344 0.154425 0.102102 0.105269 0.124580 0.148129 0.163585 0.138963 0.133982 0.122596
qa: -0.0817 -0.0872 -0.3680 -0.0296 -0.4055 0.2249 -0.0993 -0.0204 -0.0143 -0.1105 -0.1358 0.0482 0.0707 -0.1409 -0.1921 0.1115 -0.1503 -0.1748 -0.3144 0.1098 0.1265 0.1255 0.1440 0.1703 0.1544 0.1021 0.1053 0.1246 0.1481 0.1636 0.1390 0.1340 0.1226
va: 1.2476 1.2162 1.9665 3.2876 3.0968 3.7960 3.8640 3.4025 3.9766 3.8388 3.9049 4.0359 3.9077 4.0754 4.0862 3.8392 4.0427 3.8038 3.9503 1.0117 1.0120 1.0096 1.0099 0.9895 1.0081 0.9805 0.9936 1.0202 1.0034 1.0031 1.0004 1.0039 1.0063
dispcorr: -0.019095959 hartree
energy: -1647.116395920255
dipole: -15.93572 16.44993 0.51421 16.88165 -15.67515 1.20649 10.72320 -12.72591 -2.00271
magnitude: 2.39393 au
magnitude: 6.08489 debye
