program: Orca
programVersion: 4.2.1
elementType: Cl Cl O N N C C C C C C C C C C C C C C H H H H H H H H H H H H H H
charge: 0
multiplicity: 1
keywords: wb97x-d3
keywords: def2-TZVPP
keywords: def2/J RIJCOSX GRIDX6 NOFINALGRIDX
keywords: grid4 nofinalgrid
keywords: scfconv7
keywords: smallprint printgap noloewdin
keywords: NOSOSCF
formula: C14H14Cl2N2O
InChI: InChI=1/C14H14Cl2N2O/c1-2-7-19-14(9-18-6-5-17-10-18)12-4-3-11(15)8-13(12)16/h2-6,8,10,14H,1,7,9H2
33 atoms
Cl 0.662523 -1.066279 -2.195543
Cl 5.289026 -0.862704 0.48814
O  -1.012557 1.239609 1.171688
N  -2.828833 -0.830977 0.470251
N  -4.882461 -0.151042 0.886171
C  -0.637083 0.239741 0.267023
C  -1.411424 -1.024085 0.645773
C  0.852211 -0.024196 0.30501
C  1.525564 -0.622259 -0.756244
C  1.600585 0.299021 1.432215
C  -3.51291 -0.917628 -0.710946
C  -3.693748 -0.351403 1.390321
C  -1.02352 2.553978 0.636365
C  2.885105 -0.886754 -0.717337
C  2.960632 0.048268 1.503469
C  3.591578 -0.543713 0.422711
C  -4.780417 -0.500021 -0.430762
C  -2.159525 2.755368 -0.31583
C  -2.009828 3.17502 -1.565414
H  -0.924073 0.520312 -0.755156
H  -1.089784 -1.869641 0.038945
H  -1.214162 -1.282813 1.687074
H  1.112209 0.765125 2.277281
H  -3.054198 -1.271853 -1.619699
H  -3.402031 -0.17969 2.41491
H  -1.132569 3.217573 1.496996
H  -0.068056 2.801486 0.157595
H  3.380194 -1.349323 -1.560072
H  3.515974 0.314038 2.392241
H  -5.621842 -0.441702 -1.104227
H  -3.152291 2.545088 0.070942
H  -2.860392 3.329362 -2.21677
H  -1.033263 3.389219 -1.98432
elementType: Cl O N C H
totalener: -1647.10759194 hartree
nucrepener: 1650.66089494 hartree
electener: -3297.76848688 hartree
oneelecener: -5537.39883259 hartree
twoeener: 2239.63034570 hartree
cpcmener: -0.02191613 hartree
kineticenergy: 1642.59374402 hartree
xcener: -113.417425399652 hartree
chargesum: 0.0000000
charge: -0.082469 -0.084577 -0.371879 -0.013835 -0.392407 0.231257 -0.114447 0.017814 -0.042453 -0.177630 -0.136901 0.026965 0.083910 -0.126246 -0.162658 0.096625 -0.150588 -0.196266 -0.249418 0.100027 0.137693 0.132925 0.144294 0.168732 0.157717 0.105435 0.089721 0.124828 0.146523 0.159932 0.129970 0.130787 0.116618
qa: -0.0825 -0.0846 -0.3719 -0.0138 -0.3924 0.2313 -0.1144 0.0178 -0.0425 -0.1776 -0.1369 0.0270 0.0839 -0.1262 -0.1627 0.0966 -0.1506 -0.1963 -0.2494 0.1000 0.1377 0.1329 0.1443 0.1687 0.1577 0.1054 0.0897 0.1248 0.1465 0.1599 0.1300 0.1308 0.1166
va: 1.2471 1.2192 1.9439 3.2811 3.0817 3.7413 3.8065 3.4895 4.0207 3.9823 3.8891 4.0534 3.8994 4.0430 4.0246 3.8630 4.0460 3.7965 3.9347 1.0122 1.0120 1.0098 1.0262 0.9965 1.0066 0.9892 0.9968 1.0200 1.0052 1.0029 1.0129 1.0034 1.0069
dispcorr: -0.017949530 hartree
energy: -1647.125541473450
dipole: -22.67484 24.37426 1.69942 12.48588 -12.36845 0.11743 3.39753 -3.60290 -0.20537
magnitude: 1.71581 au
magnitude: 4.36124 debye
