program: Orca
programVersion: 4.2.1
elementType: Cl Cl O N N C C C C C C C C C C C C C C H H H H H H H H H H H H H H
charge: 0
multiplicity: 1
keywords: wb97x-d3
keywords: def2-TZVPP
keywords: def2/J RIJCOSX GRIDX6 NOFINALGRIDX
keywords: grid4 nofinalgrid
keywords: scfconv7
keywords: smallprint printgap noloewdin
keywords: NOSOSCF
formula: C14H14Cl2N2O
InChI: InChI=1/C14H14Cl2N2O/c1-2-7-19-14(9-18-6-5-17-10-18)12-4-3-11(15)8-13(12)16/h2-6,8,10,14H,1,7,9H2
33 atoms
Cl 0.735346 -1.569263 -1.941122
Cl 5.285012 -0.962129 0.808772
O  -0.932895 1.474551 0.7805
N  -2.820784 -0.659459 0.410753
N  -4.692591 -0.727644 -0.750454
C  -0.576482 0.289859 0.125579
C  -1.422247 -0.838486 0.716595
C  0.897869 -0.016794 0.281406
C  1.574452 -0.855826 -0.599535
C  1.627144 0.517331 1.338508
C  -3.717842 0.127682 1.076586
C  -3.455289 -1.140208 -0.682674
C  -0.885397 2.640902 -0.02698
C  2.919133 -1.155405 -0.453616
C  2.972087 0.236906 1.513889
C  3.606705 -0.599662 0.611623
C  -4.869238 0.064937 0.348176
C  -2.143309 2.815544 -0.818102
C  -2.852812 3.935582 -0.842536
H  -0.808604 0.353352 -0.945689
H  -1.102801 -1.80128 0.319359
H  -1.289583 -0.879405 1.79831
H  1.137375 1.175545 2.043235
H  -3.469453 0.645553 1.987228
H  -2.963934 -1.796776 -1.385779
H  -0.737025 3.488316 0.644832
H  -0.015312 2.611227 -0.695109
H  3.417586 -1.806504 -1.158389
H  3.513141 0.668422 2.344618
H  -5.811082 0.548258 0.558354
H  -2.467878 1.969457 -1.418114
H  -3.743796 4.024311 -1.450958
H  -2.572319 4.807591 -0.262372
elementType: Cl O N C H
totalener: -1647.10514565 hartree
nucrepener: 1638.86678911 hartree
electener: -3285.97193476 hartree
oneelecener: -5513.64696381 hartree
twoeener: 2227.67502905 hartree
cpcmener: -0.02310855 hartree
kineticenergy: 1642.58818135 hartree
xcener: -113.415873833346 hartree
chargesum: 0.0000000
charge: -0.081395 -0.084347 -0.373571 -0.015926 -0.391108 0.214265 -0.121444 0.011007 -0.035397 -0.170264 -0.129611 0.028648 0.096548 -0.130083 -0.167611 0.100557 -0.149515 -0.176728 -0.271735 0.115946 0.136763 0.134981 0.145533 0.167471 0.153822 0.103898 0.095418 0.125457 0.145721 0.160049 0.118984 0.129731 0.113935
qa: -0.0814 -0.0843 -0.3736 -0.0159 -0.3911 0.2143 -0.1214 0.0110 -0.0354 -0.1703 -0.1296 0.0286 0.0965 -0.1301 -0.1676 0.1006 -0.1495 -0.1767 -0.2717 0.1159 0.1368 0.1350 0.1455 0.1675 0.1538 0.1039 0.0954 0.1255 0.1457 0.1600 0.1190 0.1297 0.1139
va: 1.2497 1.2195 1.9334 3.2738 3.1029 3.7484 3.7948 3.4850 4.0168 3.9793 3.9053 4.0371 3.8621 4.0475 4.0291 3.8626 4.0390 3.8063 3.9586 0.9941 1.0137 1.0087 1.0246 1.0035 1.0045 0.9990 0.9928 1.0201 1.0059 1.0038 1.0035 1.0023 1.0113
dispcorr: -0.017499296 hartree
energy: -1647.122644950325
dipole: -24.01269 25.66021 1.64752 16.52314 -15.84086 0.68228 3.72394 -2.78897 0.93496
magnitude: 2.01345 au
magnitude: 5.11779 debye
