program: Orca
programVersion: 4.2.1
elementType: Cl Cl O N N C C C C C C C C C C C C C C H H H H H H H H H H H H H H
charge: 0
multiplicity: 1
keywords: wb97x-d3
keywords: def2-TZVPP
keywords: def2/J RIJCOSX GRIDX6 NOFINALGRIDX
keywords: grid4 nofinalgrid
keywords: scfconv7
keywords: smallprint printgap noloewdin
keywords: NOSOSCF
formula: C14H14Cl2N2O
InChI: InChI=1/C14H14Cl2N2O/c1-2-7-19-14(9-18-6-5-17-10-18)12-4-3-11(15)8-13(12)16/h2-6,8,10,14H,1,7,9H2
33 atoms
Cl 0.538747 -1.130649 -2.27666
Cl 5.225278 -0.652466 0.25936
O  -1.096173 1.265909 1.024777
N  -2.859757 -0.974321 0.602148
N  -4.921857 -0.484396 1.20296
C  -0.740646 0.203004 0.177275
C  -1.42321 -1.080951 0.664976
C  0.754726 -0.000579 0.18408
C  1.420566 -0.60499 -0.877966
C  1.51933 0.379292 1.283271
C  -3.628671 -1.087261 -0.523578
C  -3.683845 -0.600563 1.605535
C  -2.000019 2.202823 0.484867
C  2.791146 -0.8105 -0.872012
C  2.88924 0.182778 1.32207
C  3.514494 -0.408291 0.237016
C  -4.899412 -0.785655 -0.128878
C  -1.37899 3.222152 -0.414711
C  -0.085952 3.379564 -0.664756
H  -1.066898 0.4084 -0.849142
H  -1.103695 -1.936678 0.070063
H  -1.133362 -1.280269 1.697298
H  1.038785 0.848231 2.13101
H  -3.218219 -1.376647 -1.477417
H  -3.323287 -0.435631 2.609525
H  -2.821625 1.70974 -0.0514
H  -2.46674 2.710689 1.334451
H  3.281124 -1.273515 -1.717291
H  3.457539 0.490338 2.188871
H  -5.794726 -0.777598 -0.731474
H  -2.098589 3.88694 -0.884233
H  0.254172 4.158034 -1.33541
H  0.682623 2.75756 -0.224004
elementType: Cl O N C H
totalener: -1647.10573864 hartree
nucrepener: 1654.42823302 hartree
electener: -3301.53397166 hartree
oneelecener: -5544.74526585 hartree
twoeener: 2243.21129419 hartree
cpcmener: -0.02233609 hartree
kineticenergy: 1642.58179517 hartree
xcener: -113.418714135804 hartree
chargesum: -0.0000000
charge: -0.080441 -0.084323 -0.390467 -0.037637 -0.387358 0.207893 -0.120055 0.004845 0.000369 -0.167562 -0.139034 0.032441 0.105821 -0.139578 -0.155486 0.099667 -0.145602 -0.202397 -0.279521 0.112965 0.135828 0.134654 0.143302 0.168503 0.162346 0.090741 0.110244 0.124107 0.146926 0.161401 0.131625 0.131905 0.123878
qa: -0.0804 -0.0843 -0.3905 -0.0376 -0.3874 0.2079 -0.1201 0.0048 0.0004 -0.1676 -0.1390 0.0324 0.1058 -0.1396 -0.1555 0.0997 -0.1456 -0.2024 -0.2795 0.1130 0.1358 0.1347 0.1433 0.1685 0.1623 0.0907 0.1102 0.1241 0.1469 0.1614 0.1316 0.1319 0.1239
va: 1.2497 1.2195 1.9279 3.2828 3.0995 3.7082 3.8300 3.4973 3.9845 3.9467 3.8960 4.0418 3.8937 4.0616 4.0210 3.8610 4.0557 3.7998 3.9362 1.0031 1.0131 1.0069 1.0275 0.9967 1.0027 0.9897 0.9944 1.0201 1.0041 1.0032 1.0040 1.0039 1.0014
dispcorr: -0.018198257 hartree
energy: -1647.123936892957
dipole: -21.36180 22.49402 1.13222 11.79114 -11.80548 -0.01434 5.22783 -5.56101 -0.33318
magnitude: 1.18031 au
magnitude: 3.00011 debye
