program: Orca
programVersion: 4.2.1
elementType: Cl Cl O N N C C C C C C C C C C C C C C H H H H H H H H H H H H H H
charge: 0
multiplicity: 1
keywords: wb97x-d3
keywords: def2-TZVPP
keywords: def2/J RIJCOSX GRIDX6 NOFINALGRIDX
keywords: grid4 nofinalgrid
keywords: scfconv7
keywords: smallprint printgap noloewdin
keywords: NOSOSCF
formula: C14H14Cl2N2O
InChI: InChI=1/C14H14Cl2N2O/c1-2-7-19-14(9-18-6-5-17-10-18)12-4-3-11(15)8-13(12)16/h2-6,8,10,14H,1,7,9H2
33 atoms
Cl 0.412221 -0.181642 -3.214953
Cl 3.888601 -2.287365 0.265185
O  -1.187005 2.058359 0.2374
N  -2.377437 -0.577889 0.338827
N  -2.87985 -1.107576 2.417829
C  -0.972587 1.126117 -0.784375
C  -2.204913 0.222328 -0.848917
C  0.281429 0.31169 -0.546799
C  0.955081 -0.340446 -1.573728
C  0.762928 0.128867 0.746342
C  -1.895019 -1.841301 0.545751
C  -2.950957 -0.182852 1.497669
C  -0.36546 3.197558 0.161278
C  2.064047 -1.139907 -1.343333
C  1.867843 -0.660769 1.010944
C  2.509267 -1.291304 -0.041874
C  -2.219369 -2.151037 1.833192
C  -0.501286 4.031802 1.386921
C  -1.225033 3.743309 2.460512
H  -0.907055 1.632428 -1.756869
H  -3.092271 0.837908 -0.998963
H  -2.129017 -0.441871 -1.708541
H  0.263267 0.614912 1.573802
H  -1.383903 -2.397021 -0.223105
H  -3.416492 0.784596 1.604828
H  0.693022 2.927043 0.037369
H  -0.625596 3.801443 -0.720555
H  2.566544 -1.632748 -2.163954
H  2.215615 -0.784796 2.027069
H  -2.015325 -3.068189 2.364035
H  0.067773 4.955639 1.354653
H  -1.252628 4.421691 3.303479
H  -1.810692 2.837816 2.550804
elementType: Cl O N C H
totalener: -1647.10678552 hartree
nucrepener: 1686.43929159 hartree
electener: -3333.54607712 hartree
oneelecener: -5608.97357012 hartree
twoeener: 2275.42749300 hartree
cpcmener: -0.02346453 hartree
kineticenergy: 1642.58978421 hartree
xcener: -113.421282683106 hartree
chargesum: 0.0000000
charge: -0.081592 -0.084939 -0.359198 -0.025517 -0.396448 0.223989 -0.106786 -0.020682 -0.014258 -0.117372 -0.138020 0.047156 0.070310 -0.139627 -0.183594 0.108951 -0.144082 -0.174688 -0.304986 0.106659 0.125367 0.125510 0.143591 0.167968 0.152819 0.100031 0.101493 0.123729 0.146796 0.160350 0.134988 0.131233 0.120850
qa: -0.0816 -0.0849 -0.3592 -0.0255 -0.3964 0.2240 -0.1068 -0.0207 -0.0143 -0.1174 -0.1380 0.0472 0.0703 -0.1396 -0.1836 0.1090 -0.1441 -0.1747 -0.3050 0.1067 0.1254 0.1255 0.1436 0.1680 0.1528 0.1000 0.1015 0.1237 0.1468 0.1603 0.1350 0.1312 0.1209
va: 1.2481 1.2186 1.9752 3.2842 3.1053 3.7977 3.8707 3.4083 3.9718 3.8569 3.9024 4.0380 3.9090 4.0733 4.0777 3.8504 4.0449 3.8133 3.9551 1.0117 1.0112 1.0101 1.0118 0.9901 1.0076 0.9801 0.9933 1.0204 1.0036 1.0034 1.0011 1.0040 1.0080
dispcorr: -0.018748535 hartree
energy: -1647.125534057412
dipole: -16.05275 16.60791 0.55516 16.98811 -15.76295 1.22517 10.80134 -12.69190 -1.89057
magnitude: 2.32023 au
magnitude: 5.89756 debye
