program: Orca
programVersion: 4.2.1
elementType: Cl Cl O N N C C C C C C C C C C C C C C H H H H H H H H H H H H H H
charge: 0
multiplicity: 1
keywords: wb97x-d3
keywords: def2-TZVPP
keywords: def2/J RIJCOSX GRIDX6 NOFINALGRIDX
keywords: grid4 nofinalgrid
keywords: scfconv7
keywords: smallprint printgap noloewdin
keywords: NOSOSCF
formula: C14H14Cl2N2O
InChI: InChI=1/C14H14Cl2N2O/c1-2-7-19-14(9-18-6-5-17-10-18)12-4-3-11(15)8-13(12)16/h2-6,8,10,14H,1,7,9H2
33 atoms
Cl 0.555291 -2.001118 -1.795228
Cl 5.199533 -0.643662 0.488341
O  -1.1389 1.440931 0.381892
N  -2.906171 -0.838887 0.604776
N  -4.855676 -1.380747 -0.276072
C  -0.751981 0.168967 -0.04533
C  -1.485403 -0.848931 0.828297
C  0.744268 -0.034605 0.064603
C  1.420842 -0.995829 -0.679223
C  1.493653 0.726135 0.956072
C  -3.820062 0.047824 1.106436
C  -3.58789 -1.668226 -0.224965
C  -0.982235 2.453049 -0.591422
C  2.78695 -1.193908 -0.560395
C  2.859068 0.550273 1.097423
C  3.498475 -0.411482 0.3327
C  -5.014224 -0.30951 0.55193
C  -1.50629 3.732514 -0.033178
C  -0.814681 4.862278 -0.006191
H  -1.062202 0.004695 -1.087781
H  -1.111927 -1.851114 0.617275
H  -1.27626 -0.643676 1.880025
H  0.993891 1.481524 1.548048
H  -3.544283 0.828437 1.793518
H  -3.097526 -2.470339 -0.757356
H  0.069081 2.568123 -0.886409
H  -1.545292 2.183198 -1.49662
H  3.28523 -1.945291 -1.156082
H  3.420526 1.155908 1.794634
H  -5.979404 0.144493 0.710318
H  -2.526301 3.708798 0.336515
H  -1.241167 5.780147 0.373868
H  0.205182 4.916034 -0.367411
totalener: -1647.08471672 hartree
nucrepener: 1623.70495151 hartree
electener: -3270.78966823 hartree
oneelecener: -5483.20916568 hartree
twoeener: 2212.41949745 hartree
kineticenergy: 1642.62055255 hartree
xcener: -113.419363513563 hartree
chargesum: -0.0000000
charge: -0.067108 -0.063926 -0.338529 -0.035790 -0.313565 0.208150 -0.161299 0.031114 -0.047022 -0.173017 -0.116569 0.039146 0.056324 -0.123128 -0.141534 0.085707 -0.107150 -0.156418 -0.208287 0.107564 0.125091 0.127680 0.140088 0.142523 0.123635 0.091291 0.096143 0.118074 0.127496 0.124066 0.113520 0.107179 0.088555
qa: -0.0671 -0.0639 -0.3385 -0.0358 -0.3136 0.2081 -0.1613 0.0311 -0.0470 -0.1730 -0.1166 0.0391 0.0563 -0.1231 -0.1415 0.0857 -0.1072 -0.1564 -0.2083 0.1076 0.1251 0.1277 0.1401 0.1425 0.1236 0.0913 0.0961 0.1181 0.1275 0.1241 0.1135 0.1072 0.0886
va: 1.2659 1.2411 1.9684 3.2803 3.1417 3.7394 3.8504 3.4325 4.0395 3.9765 3.9054 4.0432 3.8712 4.0381 4.0311 3.9405 4.0624 3.8944 3.9708 1.0104 1.0150 1.0081 1.0265 1.0109 1.0087 0.9914 0.9954 1.0213 1.0119 1.0103 1.0110 1.0086 1.0143
dispcorr: -0.016398781 hartree
energy: -1647.101115498362
dipole: -20.42137 21.75297 1.33160 18.46728 -17.58320 0.88408 4.81405 -4.40896 0.40509
magnitude: 1.64889 au
magnitude: 4.19115 debye
