program: Gaussian 09
title: 000063419
version: EM64L-G09RevD.01
frameworkgroup: C1[X(C18H19N3O2)]
method: RPBEPBE
basis: SDD
operation: Freq
keyword: #p
keyword: freq=noraman
keyword: PBEPBE/SDD
title: #p freq=noraman PBEPBE/SDD
converged: YES YES NO NO
title: Mulliken charges:
elementType: O O N N N C C C C C C C C C C C C C C C C C C H H H H H H H H H H H H H H H H H H H
charge: -0.245069 -0.228340 -0.228160 -0.254451 -0.077462 -0.462590 0.361967 0.060112 0.123693 0.204055 0.469262 -0.469856 -0.321854 -0.337033 -0.221122 -0.246603 -0.334661 -0.379435 -0.615005 -0.640009 -0.221528 -0.226068 -0.247489 0.267180 0.266777 0.195941 0.254062 0.288451 0.274899 0.233040 0.235653 0.279836 0.231521 0.184543 0.227534 0.230909 0.175361 0.222957 0.278138 0.230773 0.227702 0.232370
chargesum: 0.00000
title: Mulliken charges with hydrogens summed into heavy atoms:
elementType: O O N N N C C C C C C C C C C C C C C C C C C
charge: -0.245069 -0.228340 -0.228160 -0.254451 -0.077462 0.071366 0.361967 0.060112 0.123693 0.204055 0.469262 -0.019853 -0.033402 -0.062134 0.011918 -0.010950 -0.054825 -0.147915 0.027980 0.036447 0.009245 0.001634 -0.015120
polarizability: 2.88787286e+02 -3.62875534e+01 2.58461124e+02 5.44978463e+00 1.70054366e+01 1.41136201e+02
1716.lowfreq: -4.0763 -0.0007 -0.0006 -0.0005 5.3996 8.6085 24.8206 27.8385 41.8469
frequency: 24.7628 27.7249 41.8189 55.2566 67.2726 78.6491 111.3879 116.8228 139.6465 167.9732 194.6861 213.1496 224.0963 241.2781 256.5410 268.2839 284.8420 326.8696 338.7176 359.8122 367.3559 379.7856 404.4104 410.6961 428.3784 444.9609 482.8812 515.3871 518.1174 570.1590 575.6024 593.2735 614.1250 637.6858 674.7410 686.2156 694.3489 729.3835 761.1429 766.7485 776.8668 783.1551 825.8551 828.8755 833.2921 879.0427 887.8894 903.6150 964.5885 968.4082 975.9503 985.8079 990.6292 997.3751 1010.4991 1026.8833 1033.5130 1037.6785 1054.4401 1067.1613 1085.8430 1091.9768 1102.6635 1120.8932 1132.1910 1151.0846 1164.4771 1174.9309 1175.7479 1193.9508 1196.6181 1228.2817 1235.7771 1277.3226 1294.4907 1295.6886 1320.1332 1329.2509 1337.0977 1367.7641 1379.9218 1387.6915 1397.2487 1417.4333 1432.0325 1443.9470 1446.8839 1453.6545 1463.1757 1468.7417 1470.8188 1483.8444 1485.6197 1488.8602 1496.8704 1569.8394 1587.5475 1596.0675 1605.2166 1611.4089 1625.9140 2770.0013 2843.6179 2858.0318 2973.3507 3004.9235 3021.3595 3044.1126 3081.8987 3114.7194 3125.9971 3136.9797 3138.0876 3147.8997 3153.2114 3154.0619 3166.5065 3170.7703 3195.5746 3208.1634
redmass: 4.4951 4.9163 3.7747 3.8741 4.3629 4.4778 4.6640 3.1457 4.5201 5.3220 3.3024 3.4376 1.1304 1.3630 4.8160 4.3598 4.0118 3.6920 4.2822 2.7528 3.0316 5.3364 2.8676 6.2478 3.6853 2.4558 4.9085 3.7288 3.4906 3.4440 5.9825 6.9917 6.3821 5.5075 4.9720 4.0791 2.1641 4.7479 2.2839 2.1556 3.8547 2.0193 2.4739 5.1925 1.7294 2.3396 1.9301 1.4514 1.3759 1.3810 2.0448 4.2718 1.4413 1.3390 3.1015 2.4022 2.2698 1.5693 2.3551 2.2345 1.8792 1.2646 2.4558 3.1193 1.3791 2.6680 2.2477 1.0630 1.1005 1.9481 1.2103 2.2733 2.6070 2.8625 1.6741 1.5013 1.8322 1.5231 1.7035 2.0370 4.0343 6.5037 1.8718 1.1443 1.1403 2.3683 2.4463 1.1221 1.0555 1.1599 2.0802 1.1392 1.7589 1.0539 1.2410 7.9355 6.5847 7.6135 7.2836 6.6703 8.2550 1.0697 1.0576 1.0576 1.0726 1.0841 1.0718 1.0739 1.1008 1.0987 1.0857 1.0884 1.0868 1.0941 1.0908 1.0915 1.0997 1.0987 1.0955 1.0947
irintensity: 0.1758 0.6466 2.7517 1.7765 1.2608 1.0245 1.4793 1.7321 0.6624 1.0175 5.7346 0.7241 0.9786 1.0078 1.8896 0.5736 5.4797 11.7423 14.0734 3.5569 2.0609 0.0505 0.7870 1.1006 1.3450 0.6695 8.3592 8.3873 4.0620 1.8630 6.8427 6.2867 1.6638 10.3440 6.3142 2.3157 61.3029 5.7390 31.9504 63.0813 20.7013 41.8914 1.0147 15.1544 4.7935 0.5688 1.8349 4.0988 0.9214 4.2372 2.7527 0.9876 1.0193 0.4954 82.8786 52.4299 28.7351 19.9199 78.3560 22.5071 6.1674 6.6046 5.7039 18.8542 19.4029 22.2134 120.7471 1.7297 12.5717 101.2518 11.0256 6.5119 149.4135 8.1661 14.8551 16.6153 155.7518 44.8045 109.4294 166.1119 23.0214 5.7852 72.0325 7.9385 11.1265 10.4164 47.5528 22.1204 20.7812 24.7622 50.8025 24.4303 107.8306 31.8676 7.8436 66.5379 23.9135 53.6899 130.1245 154.1017 71.3771 116.7888 63.7264 224.8533 35.1129 19.0231 38.2031 40.3717 37.5097 10.2613 10.1142 3.9143 4.4546 28.7304 5.9186 10.1186 27.5016 21.2489 0.8841 1.8191
temp: 298.150 k
press: 1.00000 atm
elementType: 8 8 7 7 7 6 6 6 6 6 6 6 6 6 6 6 6 6 6 6 6 6 6 1 1 1 1 1 1 1 1 1 1 1 1 1 1 1 1 1 1 1
symmnumber: 1
zpe: 882393.7 jmol-1
zpe.correction: 0.336086 hartree
zpe.thermalcorrener: 0.356612 hartree
zpe.thermalcorrenthalpy: 0.357556 hartree
zpe.thermalcorrgfe: 0.285607 hartree
zpe.sumelectzpe: -1010.359248 hartree
zpe.sumelectthermal: -1010.338723 hartree
zpe.sumelectthermalent: -1010.337778 hartree
zpe.sumelectthermalfe: -1010.409727 hartree
dipole: -0.6833 2.9641 3.4392
dipole: 4.5914
quadrupole: -131.3413 -128.8632 -134.7430
quadrupole: -15.8460 6.3142 4.5696
quadrupole: 0.3078 2.7859 -3.0938 -15.8460 6.3142 4.5696
hfenergy: -1010.6953344 hartree
pointgroup: C01 [X(C18H19N3O2)]
dipole: 0.0918972 1.1672079 1.3756096 debye
polarizability: 262.0676059|-38.4475113|283.9704158|13.7313575|15.4324038|142.3465889 unknown
InChI: InChI=1S/C18H19N3O2/c1-19(2)12-17(22)21-13-20(14-8-4-3-5-9-14)18(23)15-10-6-7-11-16(15)21/h3-11H,12-13H2,1-2H3
charge 0 multiplicity 1
42 atoms
O  -2.235053 -2.230139 -0.590038
O  3.306138 0.134411 -0.54405
N  1.271537 -0.364039 0.485119
N  -1.160471 -0.353656 0.34928
N  2.996294 2.93063 -0.267885
C  0.021972 0.044083 1.15145
C  1.331873 -1.783373 0.268572
C  0.082242 -2.452348 0.090694
C  -1.205309 -1.700859 -0.074867
C  2.259437 0.542341 0.024516
C  -2.250414 0.569436 0.175098
C  1.971647 2.041278 0.281334
C  2.539177 -2.523183 0.250189
C  0.05835 -3.859429 -0.068343
C  2.491004 -3.924245 0.093214
C  1.254916 -4.599493 -0.057768
C  -3.043677 0.54099 -1.002711
C  -2.525598 1.538706 1.176153
C  2.512285 4.31854 -0.403508
C  4.300289 2.845779 0.420855
C  -4.081637 1.479829 -1.171776
C  -3.560646 2.480928 0.990328
C  -4.344083 2.458724 -0.184511
H  -0.013473 -0.446736 2.145215
H  -0.000033 1.129324 1.293553
H  1.827706 2.187453 1.389706
H  1.006555 2.296806 -0.198814
H  3.493743 -2.00635 0.349237
H  -0.913755 -4.336975 -0.227241
H  3.428086 -4.491808 0.091406
H  1.231716 -5.68729 -0.178058
H  -2.854466 -0.216844 -1.764989
H  -1.965512 1.544068 2.118149
H  2.284383 4.815289 0.574779
H  1.597291 4.341636 -1.022579
H  3.282478 4.921727 -0.91537
H  4.246641 3.166073 1.493582
H  5.025344 3.498456 -0.095717
H  4.675357 1.812655 0.368425
H  -4.685674 1.447726 -2.085158
H  -3.762177 3.220332 1.773246
H  -5.150783 3.185646 -0.32602
