program: Orca
programVersion: 4.2.1
elementType: Cl Cl O N N C C C C C C C C C C C C C C H H H H H H H H H H H H H H
charge: 0
multiplicity: 1
keywords: wb97x-d3
keywords: def2-TZVPP
keywords: def2/J RIJCOSX GRIDX6 NOFINALGRIDX
keywords: grid4 nofinalgrid
keywords: scfconv7
keywords: smallprint printgap noloewdin
keywords: NOSOSCF
formula: C14H14Cl2N2O
InChI: InChI=1/C14H14Cl2N2O/c1-2-7-19-14(9-18-6-5-17-10-18)12-4-3-11(15)8-13(12)16/h2-6,8,10,14H,1,7,9H2
33 atoms
Cl 0.538727 -1.207621 -2.237794
Cl 5.23022 -0.671052 0.273295
O  -1.086966 1.243346 1.047601
N  -2.852533 -0.980063 0.576122
N  -4.905165 -0.434002 1.172924
C  -0.732004 0.203725 0.176584
C  -1.419202 -1.090145 0.635296
C  0.763787 0.002376 0.183227
C  1.423861 -0.642678 -0.857725
C  1.534933 0.427578 1.260514
C  -3.624302 -1.072384 -0.551127
C  -3.675612 -0.582761 1.576492
C  -2.006205 2.181204 0.541379
C  2.793156 -0.854509 -0.845094
C  2.903706 0.227039 1.30162
C  3.525517 -0.414871 0.243512
C  -4.886886 -0.736724 -0.155476
C  -1.414221 3.193604 -0.388118
C  -0.127425 3.361947 -0.657378
H  -1.053106 0.428405 -0.8482
H  -1.098108 -1.932567 0.021996
H  -1.126077 -1.308109 1.663662
H  1.053463 0.942052 2.080445
H  -3.217049 -1.37489 -1.501642
H  -3.314048 -0.42057 2.580779
H  -2.853841 1.687509 0.046956
H  -2.430486 2.692248 1.410745
H  3.277636 -1.351144 -1.673512
H  3.481576 0.570339 2.147971
H  -5.782251 -0.707979 -0.755945
H  -2.146286 3.840785 -0.862344
H  0.198595 4.128856 -1.345933
H  0.648666 2.755651 -0.210168
totalener: -1647.08352800 hartree
nucrepener: 1656.90328673 hartree
electener: -3303.98681472 hartree
oneelecener: -5549.69917619 hartree
twoeener: 2245.71236147 hartree
kineticenergy: 1642.61422265 hartree
xcener: -113.424220106387 hartree
chargesum: -0.0000000
charge: -0.073193 -0.065138 -0.364435 -0.040879 -0.300820 0.206905 -0.153414 -0.004434 -0.001996 -0.155788 -0.131945 0.025255 0.080598 -0.142762 -0.132222 0.092480 -0.105505 -0.180117 -0.212065 0.115215 0.129495 0.121334 0.137073 0.144287 0.130846 0.092267 0.101432 0.115987 0.127692 0.125374 0.106182 0.105434 0.106855
qa: -0.0732 -0.0651 -0.3644 -0.0409 -0.3008 0.2069 -0.1534 -0.0044 -0.0020 -0.1558 -0.1319 0.0253 0.0806 -0.1428 -0.1322 0.0925 -0.1055 -0.1801 -0.2121 0.1152 0.1295 0.1213 0.1371 0.1443 0.1308 0.0923 0.1014 0.1160 0.1277 0.1254 0.1062 0.1054 0.1069
va: 1.2588 1.2400 1.9509 3.2726 3.1236 3.6864 3.8539 3.5459 4.0022 3.9456 3.8815 4.0537 3.9185 4.0674 4.0241 3.9336 4.0676 3.8295 3.9592 1.0023 1.0176 1.0102 1.0311 1.0063 1.0100 0.9869 0.9952 1.0222 1.0111 1.0108 1.0099 1.0101 1.0055
dispcorr: -0.018227579 hartree
energy: -1647.101755575887
dipole: -21.43937 22.32477 0.88539 12.07914 -11.99578 0.08336 5.10608 -5.37740 -0.27132
magnitude: 0.92978 au
magnitude: 2.36331 debye
