program: Orca
programVersion: 4.2.1
elementType: Cl Cl O N N C C C C C C C C C C C C C C H H H H H H H H H H H H H H
charge: 0
multiplicity: 1
keywords: wb97x-d3
keywords: def2-TZVPP
keywords: def2/J RIJCOSX GRIDX6 NOFINALGRIDX
keywords: grid4 nofinalgrid
keywords: scfconv7
keywords: smallprint printgap noloewdin
keywords: NOSOSCF
formula: C14H14Cl2N2O
InChI: InChI=1/C14H14Cl2N2O/c1-2-7-19-14(9-18-6-5-17-10-18)12-4-3-11(15)8-13(12)16/h2-6,8,10,14H,1,7,9H2
33 atoms
Cl 0.296183 0.662857 -2.919684
Cl 3.882436 -2.059526 -0.032705
O  -1.496365 1.783777 0.917424
N  -2.527943 -0.887823 0.457293
N  -2.921836 -1.856386 2.400149
C  -1.243312 1.102029 -0.280221
C  -2.416335 0.149321 -0.533361
C  0.060711 0.339446 -0.234173
C  0.814391 0.077206 -1.370952
C  0.517671 -0.188281 0.969847
C  -2.010745 -2.153704 0.376271
C  -3.056068 -0.765882 1.701599
C  -0.980986 3.098777 0.967757
C  1.991646 -0.653274 -1.325232
C  1.684201 -0.926364 1.046595
C  2.419112 -1.148998 -0.106516
C  -2.270333 -2.732142 1.583177
C  0.510649 3.177724 0.871784
C  1.14752 3.870217 -0.062111
H  -1.225164 1.805533 -1.123591
H  -3.343886 0.724075 -0.559132
H  -2.29554 -0.313732 -1.513032
H  -0.056446 -0.018579 1.870958
H  -1.515138 -2.515212 -0.508912
H  -3.529204 0.144701 2.034835
H  -1.430196 3.717566 0.178291
H  -1.317475 3.501251 1.925872
H  2.562486 -0.830218 -2.225486
H  2.014165 -1.330128 1.993146
H  -2.024798 -3.731848 1.9043
H  1.078124 2.64173 1.625297
H  2.226671 3.924383 -0.093028
H  0.613901 4.40987 -0.835551
totalener: -1647.08162354 hartree
nucrepener: 1703.86556813 hartree
electener: -3350.94719167 hartree
oneelecener: -5644.03137949 hartree
twoeener: 2293.08418781 hartree
kineticenergy: 1642.63438249 hartree
xcener: -113.426959406519 hartree
chargesum: -0.0000000
charge: -0.078359 -0.068475 -0.337003 -0.039306 -0.305999 0.223334 -0.122773 0.037885 -0.023253 -0.178522 -0.127442 0.038290 0.025818 -0.140024 -0.130485 0.093042 -0.101873 -0.140298 -0.201106 0.092854 0.110825 0.113142 0.143902 0.141863 0.127652 0.071546 0.092304 0.113971 0.128572 0.124252 0.117563 0.110176 0.087925
qa: -0.0784 -0.0685 -0.3370 -0.0393 -0.3060 0.2233 -0.1228 0.0379 -0.0233 -0.1785 -0.1274 0.0383 0.0258 -0.1400 -0.1305 0.0930 -0.1019 -0.1403 -0.2011 0.0929 0.1108 0.1131 0.1439 0.1419 0.1277 0.0715 0.0923 0.1140 0.1286 0.1243 0.1176 0.1102 0.0879
va: 1.2515 1.2362 1.9841 3.2786 3.1328 3.7910 3.9360 3.4260 3.9610 3.8713 3.8886 4.0507 3.9684 4.0789 4.0573 3.9268 4.0572 3.7825 3.9489 1.0209 1.0103 1.0094 1.0176 1.0000 1.0171 0.9983 0.9947 1.0226 1.0097 1.0106 1.0076 1.0089 1.0134
dispcorr: -0.019495971 hartree
energy: -1647.101119511090
dipole: -13.58917 13.85597 0.26680 13.55447 -12.29127 1.26320 8.44627 -9.46448 -1.01820
magnitude: 1.64426 au
magnitude: 4.17937 debye
