program: Orca
programVersion: 4.2.1
elementType: Cl Cl O N N C C C C C C C C C C C C C C H H H H H H H H H H H H H H
charge: 0
multiplicity: 1
keywords: wb97x-d3
keywords: def2-TZVPP
keywords: def2/J RIJCOSX GRIDX6 NOFINALGRIDX
keywords: grid4 nofinalgrid
keywords: scfconv7
keywords: smallprint printgap noloewdin
keywords: NOSOSCF
formula: C14H14Cl2N2O
InChI: InChI=1/C14H14Cl2N2O/c1-2-7-19-14(9-18-6-5-17-10-18)12-4-3-11(15)8-13(12)16/h2-6,8,10,14H,1,7,9H2
33 atoms
Cl 0.661351 -0.256465 -3.124916
Cl 3.82702 -2.329085 0.654398
O  -1.218196 2.028636 0.116366
N  -2.421561 -0.615091 0.308967
N  -2.308772 -2.275349 1.758924
C  -0.954674 1.029246 -0.825312
C  -2.191859 0.130199 -0.898693
C  0.271988 0.215748 -0.477884
C  1.052804 -0.4120 -1.441319
C  0.617448 0.011316 0.855181
C  -2.936074 -0.139793 1.486206
C  -2.054378 -1.901126 0.539424
C  -0.334345 3.128828 0.059574
C  2.148698 -1.193315 -1.109586
C  1.701156 -0.767191 1.217154
C  2.466052 -1.361344 0.226648
C  -2.860223 -1.183658 2.361473
C  -0.680635 4.071359 1.16214
C  -0.931312 5.359978 0.984384
H  -0.826829 1.472026 -1.823488
H  -3.066837 0.743311 -1.121556
H  -2.070184 -0.573704 -1.722895
H  0.01423 0.465112 1.630685
H  -3.300182 0.867507 1.58856
H  -1.607409 -2.512689 -0.230718
H  0.706544 2.794949 0.173859
H  -0.404103 3.633481 -0.914028
H  2.740649 -1.663172 -1.881865
H  1.941809 -0.918763 2.259595
H  -3.180782 -1.207727 3.390948
H  -0.693352 3.649814 2.162295
H  -1.144593 6.015746 1.817073
H  -0.931654 5.81313 0.000544
totalener: -1647.08364849 hartree
nucrepener: 1673.29752194 hartree
electener: -3320.38117043 hartree
oneelecener: -5582.75693009 hartree
twoeener: 2262.37575965 hartree
kineticenergy: 1642.62251372 hartree
xcener: -113.422613277792 hartree
chargesum: -0.0000000
charge: -0.074601 -0.064560 -0.331868 -0.037419 -0.298721 0.224002 -0.134985 -0.014294 -0.025771 -0.141483 -0.122665 0.027974 0.050228 -0.136185 -0.123849 0.090692 -0.104862 -0.152740 -0.202528 0.093795 0.112820 0.115316 0.133586 0.145861 0.126034 0.099376 0.077820 0.115809 0.126597 0.124013 0.110848 0.106314 0.085444
qa: -0.0746 -0.0646 -0.3319 -0.0374 -0.2987 0.2240 -0.1350 -0.0143 -0.0258 -0.1415 -0.1227 0.0280 0.0502 -0.1362 -0.1238 0.0907 -0.1049 -0.1527 -0.2025 0.0938 0.1128 0.1153 0.1336 0.1459 0.1260 0.0994 0.0778 0.1158 0.1266 0.1240 0.1108 0.1063 0.0854
va: 1.2572 1.2399 1.9811 3.2775 3.1288 3.7527 3.9197 3.4412 3.9811 3.9103 3.8868 4.0538 3.9005 4.0674 4.0671 3.9416 4.0554 3.8895 3.9687 1.0179 1.0134 1.0092 1.0188 1.0124 1.0056 0.9821 1.0046 1.0223 1.0105 1.0100 1.0100 1.0089 1.0172
dispcorr: -0.018069104 hartree
energy: -1647.101717591724
dipole: -17.34295 17.40180 0.05884 20.81022 -19.26682 1.54340 8.38750 -9.18054 -0.79303
magnitude: 1.73621 au
magnitude: 4.41310 debye
