program: Orca
programVersion: 4.2.1
elementType: Cl Cl O N N C C C C C C C C C C C C C C H H H H H H H H H H H H H H
charge: 0
multiplicity: 1
keywords: wb97x-d3
keywords: def2-TZVPP
keywords: def2/J RIJCOSX GRIDX6 NOFINALGRIDX
keywords: grid4 nofinalgrid
keywords: scfconv7
keywords: smallprint printgap noloewdin
keywords: NOSOSCF
formula: C14H14Cl2N2O
InChI: InChI=1/C14H14Cl2N2O/c1-2-7-19-14(9-18-6-5-17-10-18)12-4-3-11(15)8-13(12)16/h2-6,8,10,14H,1,7,9H2
33 atoms
Cl 0.601422 -1.935405 -1.973361
Cl 5.329383 -1.148026 0.401116
O  -0.770254 1.496256 0.453621
N  -2.760575 -0.525633 0.49745
N  -4.693813 0.495424 0.791609
C  -0.513591 0.243377 -0.111326
C  -1.354421 -0.801476 0.636768
C  0.954447 -0.095292 -0.006222
C  1.542987 -1.080675 -0.792472
C  1.768925 0.554242 0.915489
C  -3.543504 -0.853669 -0.577987
C  -3.501899 0.295547 1.279578
C  -1.50191 2.394453 -0.364002
C  2.883265 -1.413403 -0.681076
C  3.109923 0.24037 1.052219
C  3.659632 -0.745167 0.249436
C  -4.732646 -0.217871 -0.36966
C  -1.829759 3.60231 0.447807
C  -3.06915 3.944767 0.770496
H  -0.804371 0.223803 -1.170578
H  -1.14854 -1.806486 0.268685
H  -1.092693 -0.780589 1.6959
H  1.344131 1.3328 1.533161
H  -3.195296 -1.505031 -1.362352
H  -3.110341 0.725286 2.188916
H  -0.90163 2.675965 -1.240769
H  -2.42608 1.935433 -0.733604
H  3.312019 -2.178179 -1.312654
H  3.722431 0.760763 1.774823
H  -5.615355 -0.246848 -0.988542
H  -0.993612 4.211866 0.77518
H  -3.276448 4.834741 1.349198
H  -3.921258 3.343011 0.477602
totalener: -1647.08343066 hartree
nucrepener: 1637.37168319 hartree
electener: -3284.45511384 hartree
oneelecener: -5510.80127849 hartree
twoeener: 2226.34616464 hartree
kineticenergy: 1642.61533493 hartree
xcener: -113.420035696508 hartree
chargesum: -0.0000000
charge: -0.075450 -0.065992 -0.355814 -0.036826 -0.318408 0.202549 -0.147276 0.037087 -0.028006 -0.157890 -0.131010 0.029601 0.070171 -0.129973 -0.135425 0.086909 -0.096502 -0.193865 -0.184539 0.102725 0.125723 0.122937 0.135354 0.144181 0.135314 0.095770 0.087218 0.117168 0.125949 0.124190 0.106410 0.103491 0.104233
qa: -0.0755 -0.0660 -0.3558 -0.0368 -0.3184 0.2025 -0.1473 0.0371 -0.0280 -0.1579 -0.1310 0.0296 0.0702 -0.1300 -0.1354 0.0869 -0.0965 -0.1939 -0.1845 0.1027 0.1257 0.1229 0.1354 0.1442 0.1353 0.0958 0.0872 0.1172 0.1259 0.1242 0.1064 0.1035 0.1042
va: 1.2560 1.2392 1.9405 3.2780 3.0899 3.7495 3.8214 3.5846 4.0077 3.9986 3.8788 4.0381 3.8788 4.0491 4.0205 3.9374 4.0424 3.8866 3.9375 1.0075 1.0199 1.0117 1.0298 1.0070 1.0132 0.9948 0.9853 1.0212 1.0122 1.0096 1.0123 1.0105 1.0275
dispcorr: -0.017651592 hartree
energy: -1647.101082249336
dipole: -25.05950 25.95691 0.89741 16.82580 -16.92585 -0.10005 5.09783 -5.30473 -0.20690
magnitude: 0.92637 au
magnitude: 2.35465 debye
