program: Orca
programVersion: 4.2.1
elementType: Cl Cl O N N N C C C C C C C C C C C C C C H H H H H H H H H H H H H H H H H
charge: 0
multiplicity: 1
keywords: wb97x-d3
keywords: def2-TZVPP
keywords: def2/J RIJCOSX GRIDX6 NOFINALGRIDX
keywords: grid4 nofinalgrid
keywords: scfconv7
keywords: smallprint printgap noloewdin
keywords: NOSOSCF
formula: C14H17Cl2N3O
InChI: InChI=1/C14H17Cl2N3O/c1-2-3-6-14(20,8-19-10-17-9-18-19)12-5-4-11(15)7-13(12)16/h4-5,7,9-10,20H,2-3,6,8H2,1H3
37 atoms
Cl 0.082408 0.117719 -2.623535
Cl -2.481885 3.60258 0.45727
O  1.571354 -1.576813 1.401027
N  -0.809127 -2.578998 -0.068527
N  -1.011303 -2.809355 1.23374
N  -2.960073 -2.420422 0.202375
C  1.225865 -1.196378 0.087245
C  2.542813 -0.907895 -0.652212
C  0.525464 -2.397438 -0.587623
C  3.205947 0.43717 -0.370534
C  0.290317 0.021906 0.120278
C  3.714684 0.657449 1.048832
C  -0.260595 0.643933 -1.002341
C  -0.059385 0.574016 1.351938
C  4.469574 1.97183 1.180611
C  -1.111449 1.735797 -0.9108
C  -0.902186 1.664911 1.478458
C  -1.975014 -2.329837 -0.660642
C  -1.42781 2.238861 0.336934
C  -2.312455 -2.709186 1.343512
H  2.372423 -0.982693 -1.726019
H  3.232691 -1.719532 -0.403804
H  1.111332 -3.298027 -0.402314
H  0.443278 -2.283232 -1.663699
H  4.053448 0.523535 -1.057343
H  2.526944 1.251112 -0.643135
H  4.368512 -0.172494 1.332737
H  2.885303 0.650165 1.757959
H  0.804382 -2.007619 1.810335
H  0.34796 0.149841 2.257039
H  3.821788 2.823302 0.962009
H  4.860827 2.109812 2.189381
H  5.315047 2.018818 0.491231
H  -1.516289 2.185583 -1.806496
H  -1.137767 2.054488 2.45877
H  -2.065035 -2.110708 -1.712943
H  -2.812395 -2.852358 2.288314
elementType: Cl O N C H
totalener: -1703.70481398 hartree
nucrepener: 1922.41045887 hartree
electener: -3626.11527285 hartree
oneelecener: -6156.63895223 hartree
twoeener: 2530.52367938 hartree
cpcmener: -0.02313254 hartree
kineticenergy: 1698.98660620 hartree
xcener: -118.935973272178 hartree
chargesum: 0.0000000
charge: -0.077573 -0.086095 -0.434627 0.146560 -0.385055 -0.406052 0.481078 -0.206331 -0.193747 -0.100832 0.031524 -0.085373 -0.193003 -0.199866 -0.286599 -0.049585 -0.146691 0.076552 0.070756 0.082223 0.101314 0.094836 0.140399 0.136312 0.084413 0.068970 0.060568 0.055518 0.224102 0.144252 0.079460 0.091952 0.078347 0.121316 0.146511 0.169112 0.165353
qa: -0.0776 -0.0861 -0.4346 0.1466 -0.3851 -0.4061 0.4811 -0.2063 -0.1937 -0.1008 0.0315 -0.0854 -0.1930 -0.1999 -0.2866 -0.0496 -0.1467 0.0766 0.0708 0.0822 0.1013 0.0948 0.1404 0.1363 0.0844 0.0690 0.0606 0.0555 0.2241 0.1443 0.0795 0.0920 0.0783 0.1213 0.1465 0.1691 0.1654
va: 1.2499 1.2185 1.9923 3.3043 2.8593 3.0288 3.5641 3.8647 3.9159 3.8577 3.3898 3.8480 4.0419 3.9102 3.9471 3.9797 4.0290 4.0388 3.8955 4.0177 1.0178 1.0305 1.0120 1.0086 1.0079 1.0055 1.0110 1.0194 1.0518 1.0300 1.0005 1.0033 1.0019 1.0205 1.0037 1.0010 0.9929
dispcorr: -0.022433970 hartree
energy: -1703.727247950915
dipole: 30.18169 -29.28237 0.89932 -6.63758 6.23672 -0.40086 8.51333 -9.24156 -0.72823
magnitude: 1.22466 au
magnitude: 3.11283 debye
