program: Gaussian 09
title: 000063415
version: EM64L-G09RevD.01
frameworkgroup: C1[X(C22H25N3O2)]
method: RPBEPBE
basis: SDD
operation: Freq
keyword: #p
keyword: freq=noraman
keyword: PBEPBE/SDD
title: #p freq=noraman PBEPBE/SDD
converged: YES YES NO NO
title: Mulliken charges:
elementType: O O N N N C C C C C C C C C C C C C C C C C C C C C C H H H H H H H H H H H H H H H H H H H H H H H H H
charge: -0.248314 -0.245388 -0.077126 -0.227711 -0.256195 -0.348732 -0.368764 -0.398435 -0.391520 -0.398101 -0.347776 -0.568327 0.203458 -0.454652 0.354057 0.057785 0.122262 0.470457 -0.321691 -0.336625 -0.221968 -0.246923 -0.334492 -0.375925 -0.221730 -0.224425 -0.246815 0.173069 0.194447 0.216054 0.169680 0.191457 0.204732 0.204923 0.193445 0.214708 0.189893 0.201489 0.233367 0.231493 0.266692 0.272343 0.263403 0.291986 0.274875 0.232688 0.235315 0.278193 0.230729 0.229961 0.227001 0.231674
chargesum: 0.00000
title: Mulliken charges with hydrogens summed into heavy atoms:
elementType: O O N N N C C C C C C C C C C C C C C C C C C C C C C
charge: -0.248314 -0.245388 -0.077126 -0.227711 -0.256195 0.018784 0.016969 -0.002246 0.006847 0.006500 0.087080 -0.070142 0.203458 0.081095 0.354057 0.057785 0.122262 0.470457 -0.029705 -0.061750 0.010720 -0.011608 -0.056299 -0.145195 0.008230 0.002576 -0.015141
polarizability: 3.08110737e+02 -4.10082354e+01 3.22572250e+02 1.76602681e+01 2.47863294e+00 1.79984462e+02
1716.lowfreq: -6.5012 -0.1353 -0.0007 -0.0005 0.0003 4.4656 13.7893 19.6792 26.6483
frequency: 13.6063 18.1061 26.6157 42.2024 47.8613 56.8614 68.1874 90.6042 105.7899 132.2365 141.5712 158.2496 175.5296 192.1902 231.5347 246.0066 252.8138 263.2581 290.2350 308.7241 334.5463 350.3352 377.4127 382.3897 390.7656 403.9879 427.0958 434.7884 446.7387 459.6834 482.8315 514.3699 517.2273 541.8083 566.4551 578.9256 597.8066 613.7725 639.1239 671.6578 681.8344 693.5842 730.4867 740.1618 763.5353 767.6844 782.1908 788.7593 799.1170 809.0097 827.3126 833.5719 853.9237 857.7520 882.3841 890.7549 904.5181 910.3883 956.7878 965.1465 968.7675 985.7210 989.9451 991.0951 997.2720 1013.1523 1027.9290 1029.3387 1035.1702 1049.3732 1056.7341 1067.5368 1084.3751 1088.8696 1103.9913 1110.1447 1122.2165 1123.2524 1151.1396 1152.7679 1156.5448 1171.8064 1174.6818 1175.1522 1185.9587 1195.6264 1226.2843 1235.4527 1239.6735 1261.0363 1266.8538 1281.7808 1289.2202 1294.0306 1298.7773 1319.6491 1330.4572 1333.7331 1340.8267 1342.7784 1350.9439 1360.2337 1368.3647 1380.1539 1388.2354 1393.9851 1402.2293 1442.6641 1444.2284 1449.0784 1450.9907 1459.5057 1461.9936 1465.0371 1469.6063 1470.3391 1479.2572 1482.5111 1490.2833 1569.5917 1587.0229 1590.7833 1597.2649 1609.8546 1621.9553 2819.1083 2831.3975 2892.5127 2967.5249 2967.9178 2974.6516 2984.2706 2986.6859 3021.7503 3026.3880 3029.4242 3034.8335 3045.8584 3055.1632 3059.8829 3125.7165 3136.1526 3137.7297 3144.7669 3148.5444 3153.4857 3165.9312 3170.2117 3194.7686 3209.5831
redmass: 4.8891 2.9657 5.7427 4.4265 5.2276 4.0396 5.5924 4.6682 3.8293 4.7625 2.6499 4.2913 3.4245 4.8340 1.9410 4.4349 4.1390 3.6270 4.9069 2.2135 7.0585 2.6031 3.6738 2.3232 5.1821 2.8671 3.7776 3.3891 3.1876 3.5949 4.8763 3.7370 3.2091 2.0499 3.1537 6.2886 4.5982 6.3773 5.3276 5.2353 4.3072 2.0347 4.6636 4.0804 2.2613 2.0679 1.9543 3.7119 1.4345 1.4584 2.2911 1.8049 1.5396 2.4201 1.8188 2.4847 1.4724 2.3046 1.3072 1.3747 1.3809 4.3770 2.0266 1.6842 1.3386 3.4371 2.3046 1.9107 2.3304 2.1840 2.4817 2.2174 1.8041 1.7377 2.3518 2.2470 2.7885 2.9872 1.3086 2.6059 2.4325 1.2782 1.0694 1.1320 1.9960 1.1322 2.1495 2.1870 2.0947 1.2612 1.1747 1.6673 1.1924 1.7545 1.3586 1.7322 1.2892 1.5469 1.4518 1.4782 1.4929 2.0978 1.5784 4.6153 6.5612 1.5790 1.5798 1.6453 1.8337 1.7649 1.0922 1.0880 1.0921 1.0867 1.7463 1.1992 1.1131 1.5610 1.6232 8.0330 6.7647 7.7110 8.1862 6.2358 7.4139 1.0713 1.0700 1.0707 1.0620 1.0721 1.0597 1.0615 1.0614 1.0864 1.0902 1.0958 1.0946 1.1034 1.1037 1.0920 1.0858 1.0885 1.0867 1.0918 1.0936 1.0915 1.0997 1.0988 1.0955 1.0945
irintensity: 0.0903 0.2320 0.5819 0.7928 1.2354 0.9297 3.6008 0.5485 2.9312 1.0327 1.1076 1.0603 2.7652 7.5940 0.3246 1.8190 0.4159 0.8397 5.7265 1.7055 18.1453 2.2710 0.7097 1.5815 0.9011 0.6225 4.8864 4.6567 0.4338 1.5906 9.0084 7.9185 4.7981 1.5113 1.1249 14.2075 1.1528 1.6525 14.0210 5.1491 6.3760 54.4406 7.1964 14.6925 17.4407 86.6881 34.0716 12.8406 3.7460 3.3670 1.0692 2.0767 2.9133 5.7403 1.2222 0.9193 3.5679 7.7764 3.5076 0.9201 4.3105 3.0793 48.1728 14.0032 0.6414 40.3531 34.6353 9.0408 4.3217 1.8974 39.1424 7.6346 2.3715 6.3167 41.2954 19.4263 13.0418 4.6060 4.1546 16.8137 63.5510 17.4001 2.2305 3.0144 156.8541 0.6073 9.1566 49.6810 163.2762 4.8656 6.5906 5.0756 0.4769 6.5898 16.7511 135.4233 4.9578 66.8666 1.2686 0.7824 3.9340 237.6367 159.7957 14.4186 4.5044 33.6161 40.9577 7.8457 21.9085 65.0045 8.0148 14.4469 4.4005 6.4749 52.7143 13.2818 26.9758 76.2785 44.6816 84.8421 6.4335 121.1555 143.4265 96.9593 46.4369 51.9596 144.6940 75.8486 38.9562 36.2196 21.5333 29.8567 32.7240 86.3091 53.2270 5.9783 32.7305 20.9337 93.3353 29.4078 9.8140 4.3185 4.5197 5.5556 28.2252 9.9133 27.0557 22.7189 0.9392 1.8785
temp: 298.150 k
press: 1.00000 atm
elementType: 8 8 7 7 7 6 6 6 6 6 6 6 6 6 6 6 6 6 6 6 6 6 6 6 6 6 6 1 1 1 1 1 1 1 1 1 1 1 1 1 1 1 1 1 1 1 1 1 1 1 1 1
symmnumber: 1
zpe: 1126716.6 jmol-1
zpe.correction: 0.429144 hartree
zpe.thermalcorrener: 0.452816 hartree
zpe.thermalcorrenthalpy: 0.453760 hartree
zpe.thermalcorrgfe: 0.372974 hartree
zpe.sumelectzpe: -1166.090505 hartree
zpe.sumelectthermal: -1166.066832 hartree
zpe.sumelectthermalent: -1166.065888 hartree
zpe.sumelectthermalfe: -1166.146674 hartree
dipole: -3.2597 0.2956 -2.8304
dipole: 4.3272
quadrupole: -161.0071 -154.4858 -155.6374
quadrupole: -12.3387 0.1648 3.4400
quadrupole: -3.9637 2.5577 1.4060 -12.3387 0.1648 3.4400
hfenergy: -1166.5196485 hartree
pointgroup: C01 [X(C22H25N3O2)]
dipole: 1.1380486 -0.5847032 -1.1230575 debye
polarizability: 282.9610378|-28.3091883|346.6366356|-19.3210579|-3.1065155|181.0697757 unknown
InChI: InChI=1S/C22H25N3O2/c26-21(13-16-23-14-7-2-8-15-23)25-17-24(18-9-3-1-4-10-18)22(27)19-11-5-6-12-20(19)25/h1,3-6,9-12H,2,7-8,13-17H2
charge 0 multiplicity 1
52 atoms
O  1.401443 2.689003 0.437737
O  -4.176373 0.344077 0.640362
N  4.120753 -0.569709 0.151581
N  -0.391681 1.51194 -0.486517
N  -2.075418 -0.234092 -0.259422
C  4.560104 -0.901724 -1.229039
C  5.282352 -0.498992 1.07933
C  5.307244 -2.251069 -1.270122
C  6.048222 -1.836369 1.114265
C  6.512897 -2.237819 -0.303683
C  3.292035 0.659274 0.212495
C  1.857674 0.398877 -0.293512
C  0.958869 1.622311 -0.077893
C  -0.962951 0.293567 -1.086021
C  -1.369516 2.550894 -0.315745
C  -2.719379 2.128026 -0.118523
C  -3.07649 0.689783 0.114166
C  -2.172516 -1.648776 -0.011702
C  -1.060693 3.932402 -0.361754
C  -3.746403 3.096334 -0.004785
C  -2.100304 4.879144 -0.248559
C  -3.445412 4.468898 -0.078401
C  -2.744349 -2.134414 1.194055
C  -1.670925 -2.572925 -0.966222
C  -2.796577 -3.522113 1.436167
C  -1.718579 -3.960084 -0.707485
C  -2.280492 -4.443498 0.494642
H  5.230035 -0.097257 -1.637597
H  3.672916 -0.950133 -1.887519
H  4.902899 -0.251786 2.088266
H  5.990315 0.319435 0.779356
H  5.638397 -2.455744 -2.306684
H  4.605641 -3.055157 -0.975111
H  5.37863 -2.618979 1.520472
H  6.913708 -1.745318 1.798477
H  7.006341 -3.228002 -0.285835
H  7.265747 -1.506809 -0.665208
H  3.742573 1.508058 -0.356995
H  3.233552 0.990093 1.264151
H  1.874695 0.13327 -1.369449
H  1.459665 -0.482165 0.246877
H  -0.193735 -0.481436 -1.168484
H  -1.334007 0.545822 -2.100537
H  -0.025092 4.252698 -0.475201
H  -4.766033 2.738376 0.169781
H  -1.855661 5.945999 -0.296202
H  -4.243025 5.213719 0.008194
H  -3.153033 -1.430984 1.921572
H  -1.273541 -2.224538 -1.926322
H  -3.239328 -3.884192 2.370546
H  -1.328208 -4.660457 -1.45407
H  -2.322188 -5.519759 0.692609
