program: Orca
programVersion: 4.2.1
elementType: Cl Cl O N N N C C C C C C C C C C C C C C H H H H H H H H H H H H H H H H H
charge: 0
multiplicity: 1
keywords: wb97x-d3
keywords: def2-TZVPP
keywords: def2/J RIJCOSX GRIDX6 NOFINALGRIDX
keywords: grid4 nofinalgrid
keywords: scfconv7
keywords: smallprint printgap noloewdin
keywords: NOSOSCF
formula: C14H17Cl2N3O
InChI: InChI=1/C14H17Cl2N3O/c1-2-3-6-14(20,8-19-10-17-9-18-19)12-5-4-11(15)7-13(12)16/h4-5,7,9-10,20H,2-3,6,8H2,1H3
37 atoms
Cl -0.345103 0.600464 -2.327085
Cl -1.913797 5.047873 0.109908
O  0.14471 -0.892949 1.993893
N  -0.618607 -3.005172 0.070473
N  -0.287012 -3.611284 1.21691
N  0.145333 -4.951357 -0.524737
C  0.03357 -0.677291 0.602346
C  1.408297 -0.925685 -0.047768
C  -1.049707 -1.626473 0.043564
C  2.454493 0.124927 0.303308
C  -0.456803 0.759436 0.424117
C  3.844542 -0.207585 -0.232941
C  -0.64967 1.389437 -0.808426
C  -0.738742 1.529005 1.553019
C  4.453354 -1.474699 0.350953
C  -1.097215 2.698574 -0.914156
C  -1.18074 2.838782 1.479169
C  -0.341368 -3.809691 -0.95263
C  -1.358821 3.416722 0.236998
C  0.162357 -4.771045 0.806212
H  1.322199 -1.008476 -1.131811
H  1.752165 -1.906227 0.294923
H  -1.300745 -1.399723 -0.98862
H  -1.960986 -1.524409 0.633292
H  2.151479 1.095424 -0.098645
H  2.507603 0.245346 1.389239
H  4.505742 0.63528 -0.016707
H  3.805254 -0.28766 -1.323524
H  0.268514 -1.843959 2.135265
H  -0.608771 1.100562 2.534035
H  4.467752 -1.439855 1.442352
H  3.905966 -2.371549 0.058035
H  5.48242 -1.605728 0.014054
H  -1.235729 3.146524 -1.888028
H  -1.381082 3.391925 2.38591
H  -0.5188 -3.533873 -1.980176
H  0.512333 -5.5179 1.501077
elementType: Cl O N C H
totalener: -1703.70507845 hartree
nucrepener: 1857.44495553 hartree
electener: -3561.15003398 hartree
oneelecener: -6026.48314081 hartree
twoeener: 2465.33310683 hartree
cpcmener: -0.02218775 hartree
kineticenergy: 1698.97789801 hartree
xcener: -118.934532241500 hartree
chargesum: -0.0000000
charge: -0.084900 -0.086072 -0.441782 0.113566 -0.385505 -0.409440 0.466653 -0.288651 -0.164641 -0.096330 0.047136 -0.112892 -0.065849 -0.176744 -0.283593 -0.109017 -0.169713 0.089188 0.097017 0.086350 0.094677 0.088536 0.129718 0.142094 0.076283 0.076205 0.073400 0.056499 0.224127 0.151973 0.083542 0.077511 0.095070 0.122959 0.145242 0.172717 0.164666
qa: -0.0849 -0.0861 -0.4418 0.1136 -0.3855 -0.4094 0.4667 -0.2887 -0.1646 -0.0963 0.0471 -0.1129 -0.0658 -0.1767 -0.2836 -0.1090 -0.1697 0.0892 0.0970 0.0864 0.0947 0.0885 0.1297 0.1421 0.0763 0.0762 0.0734 0.0565 0.2241 0.1520 0.0835 0.0775 0.0951 0.1230 0.1452 0.1727 0.1647
va: 1.2356 1.2185 1.9792 3.3305 2.8551 3.0263 3.6341 3.9112 3.8792 3.8400 3.3534 3.9042 3.9958 3.9983 3.9261 4.0390 4.0348 4.0380 3.8693 4.0156 1.0259 1.0155 1.0212 1.0096 1.0158 1.0283 1.0056 1.0068 1.0540 1.0315 1.0006 0.9990 1.0037 1.0222 1.0067 0.9941 0.9937
dispcorr: -0.020462452 hartree
energy: -1703.725540901874
dipole: 25.18611 -25.41084 -0.22473 -19.78150 20.06894 0.28744 7.53097 -7.95860 -0.42763
magnitude: 0.56213 au
magnitude: 1.42882 debye
