program: Orca
programVersion: 4.2.1
elementType: Cl Cl O N N N C C C C C C C C C C C C C C H H H H H H H H H H H H H H H H H
charge: 0
multiplicity: 1
keywords: wb97x-d3
keywords: def2-TZVPP
keywords: def2/J RIJCOSX GRIDX6 NOFINALGRIDX
keywords: grid4 nofinalgrid
keywords: scfconv7
keywords: smallprint printgap noloewdin
keywords: NOSOSCF
formula: C14H17Cl2N3O
InChI: InChI=1/C14H17Cl2N3O/c1-2-3-6-14(20,8-19-10-17-9-18-19)12-5-4-11(15)7-13(12)16/h4-5,7,9-10,20H,2-3,6,8H2,1H3
37 atoms
Cl -0.318859 0.549074 -2.322739
Cl -1.596198 5.061177 0.162599
O  0.029522 -1.029834 1.984544
N  -0.843826 -3.065423 0.030645
N  -0.56835 -3.706163 1.17316
N  -0.205334 -5.051668 -0.580136
C  -0.050816 -0.78962 0.595348
C  1.313384 -1.111417 -0.043843
C  -1.184752 -1.66225 0.011672
C  2.420476 -0.140174 0.34513
C  -0.445377 0.677616 0.431069
C  3.784655 -0.587487 -0.164213
C  -0.584088 1.3351 -0.794506
C  -0.685233 1.450132 1.567761
C  4.902931 0.349381 0.265972
C  -0.938345 2.673366 -0.886001
C  -1.035861 2.787989 1.508045
C  -0.609688 -3.875497 -0.999214
C  -1.160786 3.393169 0.272495
C  -0.193019 -4.888682 0.753444
H  1.235011 -1.165967 -1.129917
H  1.601779 -2.117101 0.280344
H  -1.404256 -1.411452 -1.022028
H  -2.096546 -1.505625 0.588523
H  2.204097 0.857052 -0.049765
H  2.456197 -0.039228 1.43364
H  3.760679 -0.654247 -1.25602
H  3.995649 -1.597961 0.198161
H  0.099268 -1.9874 2.115927
H  -0.593462 0.99996 2.543331
H  4.980163 0.398182 1.353839
H  5.870014 0.021757 -0.117333
H  4.732931 1.364954 -0.096528
H  -1.034564 3.143145 -1.854671
H  -1.206101 3.34196 2.420469
H  -0.755335 -3.575698 -2.025018
H  0.097692 -5.665505 1.442794
elementType: Cl O N C H
totalener: -1703.70633257 hartree
nucrepener: 1848.86408265 hartree
electener: -3552.57041522 hartree
oneelecener: -6009.29196647 hartree
twoeener: 2456.72155126 hartree
cpcmener: -0.02229193 hartree
kineticenergy: 1698.97821265 hartree
xcener: -118.933285092259 hartree
chargesum: -0.0000000
charge: -0.085196 -0.086026 -0.440203 0.112641 -0.386747 -0.411790 0.469376 -0.272387 -0.163965 -0.095251 0.039844 -0.082598 -0.063239 -0.174990 -0.289186 -0.108895 -0.171783 0.090700 0.097737 0.088301 0.092507 0.087611 0.129639 0.141178 0.063595 0.068823 0.059314 0.060159 0.223022 0.151568 0.080205 0.091198 0.078659 0.122850 0.145228 0.172828 0.165274
qa: -0.0852 -0.0860 -0.4402 0.1126 -0.3867 -0.4118 0.4694 -0.2724 -0.1640 -0.0953 0.0398 -0.0826 -0.0632 -0.1750 -0.2892 -0.1089 -0.1718 0.0907 0.0977 0.0883 0.0925 0.0876 0.1296 0.1412 0.0636 0.0688 0.0593 0.0602 0.2230 0.1516 0.0802 0.0912 0.0787 0.1229 0.1452 0.1728 0.1653
va: 1.2351 1.2187 1.9783 3.3273 2.8563 3.0275 3.6213 3.8947 3.8832 3.8390 3.3533 3.8779 3.9934 3.9939 3.9472 4.0395 4.0374 4.0366 3.8691 4.0141 1.0271 1.0194 1.0211 1.0102 1.0123 1.0306 1.0053 1.0073 1.0547 1.0320 1.0000 1.0042 1.0004 1.0223 1.0067 0.9938 0.9932
dispcorr: -0.019980069 hartree
energy: -1703.726312640760
dipole: 25.00294 -25.21174 -0.20879 -16.71553 16.96647 0.25094 7.32597 -7.74544 -0.41947
magnitude: 0.53153 au
magnitude: 1.35103 debye
