program: Orca
programVersion: 4.2.1
elementType: Cl Cl O N N N C C C C C C C C C C C C C C H H H H H H H H H H H H H H H H H
charge: 0
multiplicity: 1
keywords: wb97x-d3
keywords: def2-TZVPP
keywords: def2/J RIJCOSX GRIDX6 NOFINALGRIDX
keywords: grid4 nofinalgrid
keywords: scfconv7
keywords: smallprint printgap noloewdin
keywords: NOSOSCF
formula: C14H17Cl2N3O
InChI: InChI=1/C14H17Cl2N3O/c1-2-3-6-14(20,8-19-10-17-9-18-19)12-5-4-11(15)7-13(12)16/h4-5,7,9-10,20H,2-3,6,8H2,1H3
37 atoms
Cl 0.145392 0.405671 -2.416455
Cl -3.36866 3.392139 0.220588
O  1.393552 -0.938131 1.829302
N  -0.445987 -2.356606 -0.04974
N  -0.84575 -2.603361 1.200792
N  -2.553119 -2.840783 -0.218174
C  1.20578 -0.603369 0.474623
C  2.523237 0.035515 0.012662
C  0.900818 -1.90106 -0.304876
C  3.727764 -0.901935 0.007487
C  0.058664 0.413325 0.340078
C  5.035099 -0.189474 -0.334232
C  -0.466035 0.894774 -0.86169
C  -0.51898 0.925814 1.501456
C  5.487273 0.821076 0.710124
C  -1.513162 1.804395 -0.908966
C  -1.560482 1.836987 1.489145
C  -1.475441 -2.493568 -0.884192
C  -2.05812 2.266897 0.273771
C  -2.115854 -2.888854 1.052004
H  2.706544 0.883403 0.678467
H  2.399523 0.457833 -0.985907
H  1.595521 -2.678143 0.015223
H  1.015752 -1.788363 -1.378266
H  3.830646 -1.392391 0.979166
H  3.573056 -1.698292 -0.726463
H  4.940491 0.303627 -1.306928
H  5.816105 -0.94474 -0.455781
H  0.677855 -1.532395 2.105715
H  -0.141698 0.607136 2.461671
H  6.460858 1.240956 0.452482
H  4.795359 1.658925 0.807187
H  5.581267 0.357239 1.694455
H  -1.894165 2.144639 -1.861724
H  -1.973024 2.198313 2.420846
H  -1.395211 -2.34166 -1.949072
H  -2.745205 -3.143215 1.890477
elementType: Cl O N C H
totalener: -1703.71563109 hartree
nucrepener: 1885.56866775 hartree
electener: -3589.28429884 hartree
oneelecener: -6082.94899191 hartree
twoeener: 2493.66469307 hartree
cpcmener: -0.01973083 hartree
kineticenergy: 1698.95441947 hartree
xcener: -118.930463407672 hartree
chargesum: 0.0000000
charge: -0.086535 -0.084912 -0.421681 0.145580 -0.383867 -0.405643 0.510873 -0.205599 -0.245387 -0.111321 0.023481 -0.123835 -0.120759 -0.185822 -0.276261 -0.088145 -0.152491 0.076704 0.083301 0.082055 0.097483 0.096075 0.144758 0.139955 0.075949 0.075304 0.055567 0.073359 0.223245 0.141277 0.092250 0.078084 0.081312 0.121230 0.143040 0.166854 0.164520
qa: -0.0865 -0.0849 -0.4217 0.1456 -0.3839 -0.4056 0.5109 -0.2056 -0.2454 -0.1113 0.0235 -0.1238 -0.1208 -0.1858 -0.2763 -0.0881 -0.1525 0.0767 0.0833 0.0821 0.0975 0.0961 0.1448 0.1400 0.0759 0.0753 0.0556 0.0734 0.2232 0.1413 0.0923 0.0781 0.0813 0.1212 0.1430 0.1669 0.1645
va: 1.2357 1.2193 2.0305 3.3044 2.8630 3.0357 3.6183 3.8076 3.9282 3.8549 3.4264 3.9167 3.9921 3.9755 3.9283 4.0181 4.0269 4.0358 3.8915 4.0190 1.0226 1.0296 0.9978 1.0037 1.0253 1.0115 1.0067 1.0045 1.0521 1.0381 1.0035 0.9999 1.0008 1.0218 1.0064 1.0027 0.9927
dispcorr: -0.020820305 hartree
energy: -1703.736451394213
dipole: 37.36683 -36.20688 1.15995 -10.67853 10.46822 -0.21031 7.51322 -8.02093 -0.50771
magnitude: 1.28354 au
magnitude: 3.26250 debye
