program: Orca
programVersion: 4.2.1
elementType: Cl Cl O N N N C C C C C C C C C C C C C C H H H H H H H H H H H H H H H H H
charge: 0
multiplicity: 1
keywords: wb97x-d3
keywords: def2-TZVPP
keywords: def2/J RIJCOSX GRIDX6 NOFINALGRIDX
keywords: grid4 nofinalgrid
keywords: scfconv7
keywords: smallprint printgap noloewdin
keywords: NOSOSCF
formula: C14H17Cl2N3O
InChI: InChI=1/C14H17Cl2N3O/c1-2-3-6-14(20,8-19-10-17-9-18-19)12-5-4-11(15)7-13(12)16/h4-5,7,9-10,20H,2-3,6,8H2,1H3
37 atoms
Cl 0.474786 0.148175 -2.400721
Cl -2.288638 3.723428 0.389769
O  1.278338 -1.702102 1.762315
N  -0.835892 -2.540825 -0.159617
N  -1.277455 -2.769774 1.080552
N  -2.998328 -2.488126 -0.31358
C  1.191086 -1.25836 0.429239
C  2.636532 -1.029903 -0.038859
C  0.577992 -2.399398 -0.414391
C  3.4802 -0.077747 0.811958
C  0.32162 0.005848 0.350721
C  3.289166 1.421042 0.579508
C  -0.038822 0.673284 -0.821645
C  -0.166995 0.55676 1.535382
C  3.66334 1.885266 -0.82048
C  -0.833268 1.811059 -0.82052
C  -0.960933 1.689188 1.571636
C  -1.872328 -2.363546 -0.977825
C  -1.292732 2.311037 0.382917
C  -2.579561 -2.730764 0.940466
H  2.641938 -0.712584 -1.081505
H  3.118396 -2.012522 -0.030572
H  1.081735 -3.331213 -0.153397
H  0.709716 -2.250869 -1.481399
H  3.332555 -0.302416 1.870396
H  4.529337 -0.313769 0.609186
H  3.916779 1.949852 1.302344
H  2.265064 1.724582 0.804112
H  0.433352 -2.11069 2.010446
H  0.094867 0.097632 2.476691
H  3.022552 1.452936 -1.590239
H  3.577333 2.969471 -0.909414
H  4.694104 1.61822 -1.064898
H  -1.089817 2.29522 -1.752465
H  -1.311575 2.073278 2.519586
H  -1.763929 -2.160713 -2.031843
H  -3.2473 -2.883629 1.773876
elementType: Cl O N C H
totalener: -1703.71331961 hartree
nucrepener: 1936.65661302 hartree
electener: -3640.36993263 hartree
oneelecener: -6185.14089374 hartree
twoeener: 2544.77096111 hartree
cpcmener: -0.01961355 hartree
kineticenergy: 1698.95788228 hartree
xcener: -118.933431683381 hartree
chargesum: -0.0000000
charge: -0.083355 -0.083945 -0.424792 0.147805 -0.384143 -0.404810 0.524755 -0.184015 -0.211456 -0.159944 -0.025782 -0.091551 -0.177027 -0.184417 -0.285809 -0.048773 -0.132941 0.079555 0.068047 0.084761 0.096601 0.098659 0.139098 0.140258 0.080849 0.087287 0.078777 0.050685 0.221150 0.137879 0.071126 0.094015 0.085839 0.120736 0.144168 0.166966 0.163746
qa: -0.0834 -0.0839 -0.4248 0.1478 -0.3841 -0.4048 0.5248 -0.1840 -0.2115 -0.1599 -0.0258 -0.0916 -0.1770 -0.1844 -0.2858 -0.0488 -0.1329 0.0796 0.0680 0.0848 0.0966 0.0987 0.1391 0.1403 0.0808 0.0873 0.0788 0.0507 0.2211 0.1379 0.0711 0.0940 0.0858 0.1207 0.1442 0.1670 0.1637
va: 1.2401 1.2203 2.0285 3.2947 2.8636 3.0349 3.6058 3.8259 3.8983 3.9096 3.4076 3.8681 3.9764 3.9280 3.9361 3.9818 4.0093 4.0356 3.9081 4.0172 1.0146 1.0226 1.0142 1.0052 1.0269 1.0007 1.0067 1.0120 1.0560 1.0398 1.0075 1.0041 1.0037 1.0203 1.0045 1.0018 0.9930
dispcorr: -0.023224889 hartree
energy: -1703.736544494243
dipole: 26.83012 -25.82676 1.00336 -7.24804 6.88248 -0.36556 5.74506 -6.19570 -0.45064
magnitude: 1.15907 au
magnitude: 2.94611 debye
