program: Orca
programVersion: 4.2.1
elementType: Cl Cl O N N N C C C C C C C C C C C C C C H H H H H H H H H H H H H H H H H
charge: 0
multiplicity: 1
keywords: wb97x-d3
keywords: def2-TZVPP
keywords: def2/J RIJCOSX GRIDX6 NOFINALGRIDX
keywords: grid4 nofinalgrid
keywords: scfconv7
keywords: smallprint printgap noloewdin
keywords: NOSOSCF
formula: C14H17Cl2N3O
InChI: InChI=1/C14H17Cl2N3O/c1-2-3-6-14(20,8-19-10-17-9-18-19)12-5-4-11(15)7-13(12)16/h4-5,7,9-10,20H,2-3,6,8H2,1H3
37 atoms
Cl -0.122825 0.555153 -2.325876
Cl -1.669283 5.041964 0.064207
O  -0.058639 -1.1003 1.981797
N  -0.862396 -3.076236 0.076116
N  -0.315984 -3.71512 -0.961859
N  -0.554285 -5.106865 0.774739
C  -0.052974 -0.788827 0.606747
C  1.333682 -1.114351 0.023738
C  -1.1676 -1.668566 0.013273
C  2.418133 -0.098357 0.371133
C  -0.462119 0.678465 0.404868
C  3.800774 -0.569064 -0.063083
C  -0.513717 1.339972 -0.824781
C  -0.829255 1.432609 1.518526
C  4.890107 0.447003 0.243463
C  -0.881435 2.672923 -0.938839
C  -1.202371 2.763589 1.437683
C  -0.993902 -3.916186 1.105745
C  -1.219636 3.378783 0.200645
C  -0.149637 -4.927294 -0.498012
H  1.284634 -1.233618 -1.057047
H  1.62342 -2.094105 0.414685
H  -1.358478 -1.427469 -1.028594
H  -2.091191 -1.489403 0.564918
H  2.201188 0.862204 -0.104774
H  2.439013 0.101543 1.449338
H  3.788767 -0.780453 -1.136611
H  4.034168 -1.516962 0.430818
H  0.793655 -0.873364 2.370393
H  -0.826414 0.967383 2.493048
H  4.703473 1.396439 -0.262514
H  4.954092 0.652682 1.314038
H  5.869523 0.091248 -0.079967
H  -0.900445 3.149533 -1.909216
H  -1.473423 3.30445 2.333903
H  -1.416096 -3.626037 2.054797
H  0.273471 -5.713946 -1.103951
elementType: Cl O N C H
totalener: -1703.71549358 hartree
nucrepener: 1844.50366262 hartree
electener: -3548.21915619 hartree
oneelecener: -6000.60605927 hartree
twoeener: 2452.38690308 hartree
cpcmener: -0.02326150 hartree
kineticenergy: 1698.94602307 hartree
xcener: -118.923398654343 hartree
chargesum: 0.0000000
charge: -0.082260 -0.084376 -0.400813 0.097929 -0.344684 -0.415209 0.485954 -0.278560 -0.142189 -0.085221 -0.015823 -0.078671 -0.118162 -0.133455 -0.287303 -0.104434 -0.183052 0.073310 0.097247 0.062516 0.089536 0.102531 0.135637 0.139381 0.066201 0.062257 0.060854 0.062156 0.223040 0.147772 0.079593 0.079691 0.091453 0.122992 0.143467 0.169034 0.161664
qa: -0.0823 -0.0844 -0.4008 0.0979 -0.3447 -0.4152 0.4860 -0.2786 -0.1422 -0.0852 -0.0158 -0.0787 -0.1182 -0.1335 -0.2873 -0.1044 -0.1831 0.0733 0.0972 0.0625 0.0895 0.1025 0.1356 0.1394 0.0662 0.0623 0.0609 0.0622 0.2230 0.1478 0.0796 0.0797 0.0915 0.1230 0.1435 0.1690 0.1617
va: 1.2384 1.2201 2.0469 3.3612 2.8767 3.0319 3.6498 3.8679 3.7942 3.8424 3.3900 3.8742 4.0273 3.9475 3.9497 4.0314 4.0546 4.0665 3.8767 4.0436 1.0296 1.0148 1.0346 1.0105 1.0154 1.0178 1.0065 1.0087 1.0186 1.0327 1.0004 0.9999 1.0044 1.0215 1.0079 1.0039 0.9951
dispcorr: -0.019987689 hartree
energy: -1703.735481263940
dipole: 25.02655 -24.68106 0.34550 -15.37634 16.69544 1.31910 9.38989 -8.48818 0.90171
magnitude: 1.63477 au
magnitude: 4.15526 debye
