program: Gaussian 09
title: 000063409
version: EM64L-G09RevD.01
frameworkgroup: C1[X(C21H23N3O2)]
method: RPBEPBE
basis: SDD
operation: Freq
keyword: #p
keyword: freq=noraman
keyword: PBEPBE/SDD
title: #p freq=noraman PBEPBE/SDD
converged: YES YES NO NO
title: Mulliken charges:
elementType: O O N N N C C C C C C C C C C C C C C C C C C C C C H H H H H H H H H H H H H H H H H H H H H H H
charge: -0.224685 -0.244907 -0.056671 -0.229017 -0.254991 -0.372430 -0.375055 -0.403129 -0.388824 -0.398804 -0.480601 0.189651 -0.463067 0.361575 0.060123 0.122760 0.469978 -0.321699 -0.337252 -0.221671 -0.246770 -0.334961 -0.379382 -0.221582 -0.225581 -0.247464 0.159414 0.251575 0.165478 0.213129 0.217681 0.191442 0.211373 0.191421 0.186011 0.215914 0.198048 0.253638 0.266855 0.268977 0.288922 0.274766 0.232922 0.235545 0.279345 0.231478 0.230638 0.227636 0.232244
chargesum: 0.00000
title: Mulliken charges with hydrogens summed into heavy atoms:
elementType: O O N N N C C C C C C C C C C C C C C C C C C C C C
charge: -0.224685 -0.244907 -0.056671 -0.229017 -0.254991 0.038560 0.003552 0.005995 0.013970 0.003121 -0.028915 0.189651 0.072765 0.361575 0.060123 0.122760 0.469978 -0.032777 -0.062486 0.011251 -0.011224 -0.055616 -0.147904 0.009057 0.002056 -0.015220
polarizability: 2.76400211e+02 -8.53824451e+00 3.37002035e+02 -2.00497774e+01 4.21918236e+00 1.67564229e+02
1716.lowfreq: -7.7237 -7.2298 -1.4328 -0.0007 -0.0007 -0.0005 16.5781 23.4601 36.2305
frequency: 16.2816 23.3892 36.1205 45.5993 47.9398 60.7585 87.5703 108.2140 126.7631 141.8233 167.1594 195.1562 200.8789 235.2386 245.6503 259.9408 277.3625 309.1180 327.3981 343.1823 356.2563 378.4457 381.1778 400.9259 404.1646 427.6923 444.7613 449.3704 482.1727 514.1344 516.5299 544.0502 568.1981 578.5867 605.8198 613.5392 636.4222 673.6095 683.8165 693.3110 728.7685 752.8669 765.0727 768.0862 781.6405 784.3888 805.4793 824.9404 832.3981 851.4936 856.8196 875.7927 885.9057 903.6263 913.2261 958.3272 965.0827 967.8482 983.9869 985.5127 990.6852 996.7423 999.9035 1011.4756 1026.9526 1035.3647 1050.5499 1056.9540 1079.7819 1083.7908 1097.6188 1115.8339 1119.7495 1124.6885 1150.6776 1153.4250 1164.7782 1174.4194 1175.1504 1180.3814 1194.6681 1210.0838 1227.6321 1234.3633 1255.9886 1267.3495 1283.7070 1293.2418 1299.7365 1316.4637 1320.9512 1332.6260 1334.5106 1341.9521 1351.2492 1354.5600 1370.4136 1378.9869 1385.9321 1387.7649 1395.6548 1443.0061 1444.4486 1448.8161 1452.0215 1461.4169 1463.8898 1467.3311 1469.7253 1476.9483 1484.6901 1493.4598 1569.8297 1587.3371 1596.0020 1604.4500 1610.7317 1625.4148 2775.5678 2807.3297 2823.3498 2965.3661 2972.5681 2987.5041 2992.7247 3000.2816 3017.2406 3034.7418 3050.2276 3059.0195 3074.4445 3124.9770 3136.1774 3138.1865 3146.8754 3150.2779 3153.8100 3166.1385 3170.5811 3195.8014 3207.9267
redmass: 4.9468 4.8803 3.5075 4.4121 3.8481 5.8804 4.4273 5.2284 4.3997 5.0029 4.3566 4.8021 3.5546 2.4203 2.8702 5.0310 4.1508 2.1429 5.1703 5.5960 2.5979 4.4681 1.9285 7.5880 2.8995 3.8054 3.0148 3.0672 4.8265 3.7927 3.4466 2.2656 3.4315 5.9490 3.8817 6.3826 5.4804 5.0827 4.2668 2.0872 4.7126 3.3452 2.3779 2.2326 2.3077 3.1413 1.4907 2.9449 1.5487 3.2331 1.4127 2.7770 1.6390 1.4368 2.4225 1.2950 1.3743 1.3817 2.1102 4.4417 1.4137 1.3441 2.4710 3.2558 2.2953 2.2374 2.0507 2.6138 1.4854 1.9044 2.4867 2.3814 2.8583 2.6146 2.6721 1.2760 2.4849 1.0685 1.1332 1.8766 1.1312 1.6636 2.2212 2.5917 1.2877 1.1879 1.2841 1.7391 1.4804 1.6655 1.5895 1.4250 1.4943 1.4170 1.5145 1.9357 1.5226 3.4052 1.6786 4.4896 2.0010 2.2374 1.3640 1.8637 1.0990 1.0850 1.0927 1.1177 2.1415 1.1212 1.9090 1.2959 7.9715 6.5545 7.7030 7.5094 6.6034 8.2005 1.0699 1.0714 1.0696 1.0630 1.0725 1.0621 1.0612 1.0843 1.0869 1.0957 1.1033 1.1028 1.0879 1.0862 1.0884 1.0867 1.0933 1.0918 1.0914 1.0997 1.0987 1.0954 1.0946
irintensity: 0.2124 0.5266 1.1881 1.1449 0.4910 1.9309 0.6895 2.2165 2.5470 2.8673 1.2022 1.7188 2.0552 1.3070 1.8306 0.9395 2.4451 3.2725 7.1002 12.6565 2.9013 0.3060 3.3315 1.4286 0.5333 1.8338 1.0322 0.7505 8.6083 7.9290 4.1700 0.4729 1.7789 13.5327 0.9678 1.6267 11.4113 5.0400 5.2347 58.9445 5.2717 11.8635 18.9680 91.7090 30.2163 11.3477 0.2292 1.6263 1.8324 3.4617 6.7718 5.2102 2.6561 4.2552 1.2568 3.9051 0.9538 4.0569 8.2842 1.7665 2.0104 0.3669 86.0231 32.0034 26.7813 10.6898 7.9107 44.1896 10.7336 10.0427 40.2954 37.3283 13.7329 16.7391 20.8079 12.7360 210.0685 3.5254 10.9643 64.9738 0.3689 16.4890 6.3488 139.6552 12.9261 2.2212 32.7621 5.2573 6.6072 128.7022 61.6912 45.3767 39.9975 3.7979 8.8221 127.7879 47.8057 41.1461 32.5749 7.7560 58.4376 7.5938 11.3565 76.5206 2.8473 12.3935 7.2987 29.2619 41.1570 17.0103 112.5925 11.6595 70.1005 20.1511 54.2673 149.9879 147.5439 65.9906 111.1252 49.6778 185.6461 42.1084 35.0662 28.9802 38.3143 15.9524 58.7268 63.8661 23.6104 78.8875 12.1371 10.9938 3.6346 4.3443 20.5814 12.9060 9.5741 27.7749 22.2803 0.8681 1.9100
temp: 298.150 k
press: 1.00000 atm
elementType: 8 8 7 7 7 6 6 6 6 6 6 6 6 6 6 6 6 6 6 6 6 6 6 6 6 6 1 1 1 1 1 1 1 1 1 1 1 1 1 1 1 1 1 1 1 1 1 1 1
symmnumber: 1
zpe: 1052577.3 jmol-1
zpe.correction: 0.400906 hartree
zpe.thermalcorrener: 0.423166 hartree
zpe.thermalcorrenthalpy: 0.424111 hartree
zpe.thermalcorrgfe: 0.347319 hartree
zpe.sumelectzpe: -1126.862655 hartree
zpe.sumelectthermal: -1126.840395 hartree
zpe.sumelectthermalent: -1126.839450 hartree
zpe.sumelectthermalfe: -1126.916242 hartree
dipole: -2.2383 1.8513 3.4104
dipole: 4.4797
quadrupole: -163.7204 -135.8151 -150.9032
quadrupole: -7.8026 -3.1193 -2.5264
quadrupole: -13.5742 14.3311 -0.7569 -7.8026 -3.1193 -2.5264
hfenergy: -1127.263561 hartree
pointgroup: C01 [X(C21H23N3O2)]
dipole: -0.5713456 -0.9696012 -1.3563497 debye
polarizability: 276.373625|-11.5903672|336.0734673|20.4293062|10.0171756|168.5193825 unknown
InChI: InChI=1S/C21H23N3O2/c25-20(15-22-13-7-2-8-14-22)24-16-23(17-9-3-1-4-10-17)21(26)18-11-5-6-12-19(18)24/h1,3-6,9-12H,2,7-8,13-16H2
charge 0 multiplicity 1
49 atoms
O  -2.398436 1.497049 0.430734
O  3.620204 1.390588 0.742844
N  -3.247291 -1.163208 0.016111
N  -0.291624 1.153954 -0.513791
N  1.917432 0.147305 -0.312479
C  -4.361211 -0.55587 -0.758591
C  -3.375583 -2.640629 0.111481
C  -5.722611 -0.896471 -0.121549
C  -4.707878 -3.033016 0.781098
C  -5.905019 -2.424737 0.015803
C  -1.922046 -0.757966 -0.456092
C  -1.583963 0.716638 -0.128861
C  0.712244 0.292741 -1.164679
C  0.221429 2.466032 -0.23205
C  1.626263 2.56095 0.009477
C  2.488162 1.344645 0.175191
C  2.52681 -1.145756 -0.14783
C  -0.580313 3.633098 -0.211336
C  2.213349 3.830033 0.233776
C  0.026549 4.886868 0.010855
C  1.422742 4.99389 0.225456
C  3.203231 -1.479144 1.05566
C  2.434244 -2.11167 -1.184901
C  3.762404 -2.763565 1.213108
C  2.988785 -3.398576 -1.011188
C  3.655287 -3.73314 0.188237
H  -4.34619 -0.924929 -1.820823
H  -4.216411 0.536321 -0.769762
H  -3.323005 -3.121753 -0.9029
H  -2.526523 -3.028935 0.705862
H  -5.768757 -0.423713 0.877753
H  -6.531937 -0.459509 -0.737561
H  -4.703846 -2.656488 1.821853
H  -4.78618 -4.136627 0.82082
H  -5.966976 -2.881889 -0.994143
H  -6.854055 -2.658042 0.53433
H  -1.797995 -0.911148 -1.565097
H  -1.169891 -1.404573 0.037865
H  0.988361 0.758556 -2.132416
H  0.297533 -0.701844 -1.35794
H  -1.657326 3.553681 -0.359184
H  3.287728 3.864124 0.440658
H  -0.597783 5.787123 0.013974
H  1.881201 5.973136 0.396534
H  3.299196 -0.733704 1.847048
H  1.965994 -1.859195 -2.143144
H  4.281158 -3.008469 2.14641
H  2.911551 -4.131712 -1.821659
H  4.090393 -4.729356 0.320438
