program: Orca
programVersion: 4.2.1
elementType: Cl Cl O N N N C C C C C C C C C C C C C C H H H H H H H H H H H H H H H H H
charge: 0
multiplicity: 1
keywords: wb97x-d3
keywords: def2-TZVPP
keywords: def2/J RIJCOSX GRIDX6 NOFINALGRIDX
keywords: grid4 nofinalgrid
keywords: scfconv7
keywords: smallprint printgap noloewdin
keywords: NOSOSCF
formula: C14H17Cl2N3O
InChI: InChI=1/C14H17Cl2N3O/c1-2-3-6-14(20,8-19-10-17-9-18-19)12-5-4-11(15)7-13(12)16/h4-5,7,9-10,20H,2-3,6,8H2,1H3
37 atoms
Cl 0.057631 0.706914 -2.217651
Cl -1.747419 5.048901 0.247092
O  -0.115772 -1.036262 2.035552
N  -0.716862 -3.026608 -0.067737
N  -0.515087 -3.666556 1.088962
N  -0.155276 -5.050767 -0.629499
C  -0.031677 -0.755546 0.66145
C  1.405266 -1.02708 0.175081
C  -1.064821 -1.624646 -0.092137
C  2.426247 -0.029109 0.707047
C  -0.449336 0.706886 0.49472
C  3.866826 -0.415009 0.384252
C  -0.445654 1.413865 -0.709367
C  -0.879005 1.414737 1.617405
C  4.181901 -0.432294 -1.106093
C  -0.843827 2.740311 -0.793652
C  -1.276906 2.738428 1.5624
C  -0.490985 -3.867831 -1.082315
C  -1.258374 3.398731 0.348278
C  -0.179827 -4.876421 0.703362
H  1.444168 -1.062843 -0.913145
H  1.68258 -2.030056 0.516733
H  -1.14226 -1.336555 -1.137834
H  -2.045258 -1.49041 0.36887
H  2.226382 0.964586 0.294993
H  2.309271 0.058441 1.78969
H  4.090372 -1.394111 0.81883
H  4.534766 0.292435 0.881795
H  -0.10794 -1.999359 2.14565
H  -0.896276 0.909763 2.570332
H  5.243942 -0.60281 -1.283192
H  3.639024 -1.218097 -1.632448
H  3.917798 0.517731 -1.574173
H  -0.825483 3.250673 -1.745885
H  -1.598021 3.247676 2.46009
H  -0.587106 -3.580158 -2.118009
H  0.052778 -5.656012 1.411465
totalener: -1703.69315481 hartree
nucrepener: 1858.69378779 hartree
electener: -3562.38694260 hartree
oneelecener: -6029.01432284 hartree
twoeener: 2466.62738023 hartree
kineticenergy: 1698.96131661 hartree
xcener: -118.930150879963 hartree
chargesum: -0.0000000
charge: -0.083123 -0.067963 -0.386735 0.110455 -0.353222 -0.328257 0.489319 -0.297555 -0.190060 -0.081929 -0.001890 -0.123492 -0.066502 -0.132408 -0.259184 -0.110810 -0.145881 0.063479 0.088859 0.083189 0.078339 0.089234 0.110147 0.134276 0.068038 0.086789 0.056104 0.071795 0.197182 0.141256 0.090129 0.074160 0.077752 0.114169 0.125318 0.141938 0.137084
qa: -0.0831 -0.0680 -0.3867 0.1105 -0.3532 -0.3283 0.4893 -0.2976 -0.1901 -0.0819 -0.0019 -0.1235 -0.0665 -0.1324 -0.2592 -0.1108 -0.1459 0.0635 0.0889 0.0832 0.0783 0.0892 0.1101 0.1343 0.0680 0.0868 0.0561 0.0718 0.1972 0.1413 0.0901 0.0742 0.0778 0.1142 0.1253 0.1419 0.1371
va: 1.2403 1.2379 2.0381 3.3193 2.8602 3.0624 3.6239 3.9344 3.8993 3.8285 3.4257 3.9042 3.9802 3.9966 3.9198 4.0462 4.0255 4.0580 3.9416 4.0246 1.0258 1.0187 1.0280 1.0065 1.0127 1.0348 1.0103 1.0077 1.0900 1.0385 1.0072 1.0007 1.0058 1.0234 1.0131 1.0008 0.9996
dispcorr: -0.020494964 hartree
energy: -1703.713649773969
dipole: 22.82013 -22.91325 -0.09312 -18.43189 18.59932 0.16743 5.11987 -5.27868 -0.15881
magnitude: 0.24885 au
magnitude: 0.63252 debye
