program: Orca
programVersion: 4.2.1
elementType: F F O N N N C C C C C C C C C C C C C C C C H H H H H H H H H H H H H
charge: 0
multiplicity: 1
keywords: wb97x-d3
keywords: def2-TZVPP
keywords: def2/J RIJCOSX GRIDX6 NOFINALGRIDX
keywords: grid4 nofinalgrid
keywords: scfconv7
keywords: smallprint printgap noloewdin
keywords: NOSOSCF
formula: C16H13F2N3O
InChI: InChI=1/C16H13F2N3O/c17-13-7-5-12(6-8-13)16(22,9-21-11-19-10-20-21)14-3-1-2-4-15(14)18/h1-8,10-11,22H,9H2
35 atoms
F  0.764451 2.022232 1.928258
F  4.222271 -1.673751 -1.06149
O  -1.228266 -0.099684 1.73034
N  -1.678912 -1.82784 -0.501418
N  -1.004748 -2.440725 -1.47764
N  -1.654232 -3.920235 0.070289
C  -0.835036 0.293808 0.437079
C  -1.841796 -0.396605 -0.501487
C  0.561639 -0.200452 0.080967
C  -0.918145 1.811915 0.297344
C  1.171887 -1.216962 0.804975
C  1.212615 0.304472 -1.040417
C  -0.091933 2.615294 1.075106
C  -1.789971 2.473401 -0.563179
C  2.40989 -1.718664 0.428085
C  2.446713 -0.185501 -1.434781
C  -0.093979 3.992163 1.017781
C  -1.818786 3.858965 -0.64369
C  -2.055702 -2.721188 0.417973
C  3.025057 -1.193497 -0.688382
C  -0.970597 4.619642 0.144409
C  -1.016205 -3.690482 -1.094895
H  -2.862313 -0.15521 -0.200929
H  -1.703506 -0.069174 -1.528828
H  0.691606 -1.645375 1.674413
H  0.759104 1.092734 -1.628987
H  -2.463471 1.913695 -1.197454
H  -0.565229 0.169176 2.37593
H  2.881289 -2.509589 0.996838
H  2.94791 0.211308 -2.307902
H  0.578981 4.561788 1.645472
H  -2.506084 4.339472 -1.326761
H  -2.619507 -2.461903 1.299326
H  -0.985362 5.699575 0.084335
H  -0.551093 -4.468362 -1.680616
elementType: F O N C H
totalener: -1056.79777540 hartree
nucrepener: 1819.85553343 hartree
electener: -2876.65330883 hartree
oneelecener: -5058.66169018 hartree
twoeener: 2182.00838135 hartree
cpcmener: -0.02897269 hartree
kineticenergy: 1052.61875102 hartree
xcener: -98.594020041066 hartree
chargesum: 0.0000000
charge: -0.226765 -0.223944 -0.397612 0.128482 -0.337538 -0.404135 0.705076 -0.181329 -0.093248 -0.309029 -0.123068 -0.208415 0.278959 -0.096653 -0.236615 -0.217785 -0.213016 -0.188942 0.056326 0.318855 -0.105491 0.049879 0.151148 0.124288 0.138625 0.151160 0.139844 0.222504 0.149642 0.151396 0.148893 0.158811 0.165997 0.163004 0.160697
qa: -0.2268 -0.2239 -0.3976 0.1285 -0.3375 -0.4041 0.7051 -0.1813 -0.0932 -0.3090 -0.1231 -0.2084 0.2790 -0.0967 -0.2366 -0.2178 -0.2130 -0.1889 0.0563 0.3189 -0.1055 0.0499 0.1511 0.1243 0.1386 0.1512 0.1398 0.2225 0.1496 0.1514 0.1489 0.1588 0.1660 0.1630 0.1607
va: 1.0589 1.0543 2.0315 3.3800 2.8734 3.0338 3.3315 3.8977 3.5379 3.7760 3.8542 3.9360 3.9192 3.8176 3.9536 3.9313 3.9824 3.9558 4.0708 3.8902 3.8541 4.0523 1.0014 1.0085 1.0257 0.9932 1.0107 1.0241 0.9992 0.9980 1.0031 0.9935 1.0088 0.9868 0.9962
dispcorr: -0.019321629 hartree
energy: -1056.817097031917
dipole: -10.68585 9.78458 -0.90127 5.86458 -3.31942 2.54516 -2.48712 2.56281 0.07569
magnitude: 2.70108 au
magnitude: 6.86561 debye
