program: Gaussian 09
title: 000063405
version: EM64L-G09RevD.01
frameworkgroup: C1[X(C20H20ClN3O3)]
method: RPBEPBE
basis: SDD
operation: Freq
keyword: #p
keyword: freq=noraman
keyword: PBEPBE/SDD
title: #p freq=noraman PBEPBE/SDD
converged: YES YES NO NO
title: Mulliken charges:
elementType: Cl O O O N N N C C C C C C C C C C C C C C C C C C C C H H H H H H H H H H H H H H H H H H H H
charge: -0.062571 -0.246727 -0.226389 -0.240930 -0.078921 -0.230048 -0.259859 -0.477810 -0.352382 -0.352545 -0.464072 0.196415 0.363638 -0.329595 -0.317154 0.061549 0.127670 0.495772 -0.319987 -0.334764 -0.219561 -0.245040 -0.334839 -0.348425 -0.092737 -0.201317 -0.260352 0.203146 0.251565 0.254347 0.181859 0.212322 0.191283 0.272477 0.269406 0.205066 0.214494 0.215148 0.198447 0.288012 0.275660 0.235055 0.237875 0.260087 0.285886 0.237540 0.261306
chargesum: 0.00000
title: Mulliken charges with hydrogens summed into heavy atoms:
elementType: Cl O O O N N N C C C C C C C C C C C C C C C C C C C C
charge: -0.062571 -0.246727 -0.226389 -0.240930 -0.078921 -0.230048 -0.259859 -0.023099 0.083823 0.051060 0.077811 0.196415 0.363638 0.089966 0.096441 0.061549 0.127670 0.495772 -0.031975 -0.059104 0.015494 -0.007165 -0.074751 -0.062539 -0.092737 0.036224 0.000954
polarizability: 2.65254172e+02 1.46840064e+01 3.52489388e+02 -2.55303495e+01 2.60394617e+00 1.75832745e+02
1716.lowfreq: -6.2258 -0.0014 -0.0007 0.0004 3.3231 5.1300 15.9537 19.2709 30.8984
frequency: 15.8971 19.1907 30.8852 42.6274 45.6516 58.6140 83.5786 103.6923 125.7851 132.1832 157.9707 171.7177 184.4050 204.1378 227.6139 236.8692 246.9852 275.8223 289.4437 317.3094 326.9435 343.0698 360.2681 377.7692 393.9006 403.2074 413.6793 433.4141 440.1828 452.0837 467.0053 487.3179 516.4899 555.7678 568.7910 569.9548 585.2598 619.6540 639.0895 656.8204 677.2464 680.6591 702.0216 734.0187 762.8573 766.1163 782.1252 783.9794 789.9116 811.7437 842.3321 853.0350 859.4116 874.6300 886.3042 897.8659 906.8923 968.5981 975.1685 980.2623 982.3679 998.2108 1005.4793 1016.2353 1028.1493 1037.6529 1052.9695 1054.4808 1076.9791 1083.7933 1090.4644 1102.2014 1104.5415 1122.1846 1139.9989 1147.7328 1156.6238 1176.3458 1183.9395 1190.6745 1195.6122 1228.1542 1233.7375 1238.5892 1271.7678 1289.7408 1290.7531 1299.3853 1301.8291 1320.0709 1324.4633 1339.3482 1350.3710 1364.3203 1371.1491 1373.0466 1382.9358 1388.1330 1396.6185 1428.2738 1442.1251 1442.8535 1447.7610 1450.3780 1454.5398 1465.5886 1468.0269 1474.3027 1495.1219 1568.6416 1574.2522 1593.6019 1603.4579 1608.1842 1625.3682 2788.6495 2856.7143 2867.2951 2959.4736 2969.3285 2977.0144 3000.6354 3022.3151 3075.1508 3081.9021 3088.0997 3139.5298 3147.9883 3150.6327 3154.8044 3162.5803 3171.6495 3179.8750 3204.5692 3208.6559
redmass: 6.9820 6.7136 4.0429 4.9927 5.3472 6.6173 5.4107 5.6682 5.5546 6.0790 4.9864 6.1807 5.3436 3.8196 5.7741 2.1461 3.7479 4.0921 6.6529 2.2305 5.5926 6.4107 2.7195 7.2728 1.9786 7.4967 4.2954 4.9160 3.3385 5.3316 2.9266 5.6416 3.6310 5.2535 3.4594 3.9840 5.8560 2.5054 5.6836 6.6873 3.4987 2.8209 5.4738 5.5314 4.3564 2.3504 1.9099 1.4967 4.5717 3.8988 1.6034 1.7317 3.6452 3.3479 1.6012 1.4177 2.5329 1.3831 1.4025 4.8681 2.1418 1.3430 2.5626 2.9935 2.1714 2.1933 2.0492 2.9408 2.0084 3.7990 2.3433 2.2632 2.1984 2.9985 2.8425 2.6516 2.5955 1.1152 1.0952 2.0810 1.1313 2.2073 1.8384 1.4584 1.2695 1.3470 1.3762 1.3957 1.5392 1.5105 2.2191 1.2416 1.6761 1.5827 1.2807 3.8001 1.6953 4.5253 1.8632 2.9775 1.1037 1.0948 1.9946 1.1885 1.1215 1.2441 1.8897 2.5621 1.1547 7.0757 7.4096 8.1095 7.2689 7.7996 8.3388 1.0699 1.0704 1.0689 1.0661 1.0661 1.0724 1.0847 1.0898 1.0890 1.0971 1.0983 1.0869 1.0915 1.0888 1.0914 1.0920 1.0988 1.0957 1.0956 1.0947
irintensity: 0.3086 0.1490 0.6084 2.0408 0.3272 1.4596 0.9607 5.4251 1.9668 2.9259 3.0517 0.0547 0.6532 3.8455 0.4501 3.3063 1.9224 2.5384 1.9741 12.5741 7.7745 15.1269 3.0630 7.5458 0.1538 1.7649 1.3887 3.8131 3.4751 8.8780 1.6846 5.7892 5.1884 2.2168 5.9998 1.7527 12.6194 3.9118 3.4544 8.7364 10.5338 35.9820 19.6136 12.9683 14.3716 33.4434 50.2503 45.1412 2.2875 21.5294 0.2564 13.7849 34.4402 11.3816 3.8208 0.5754 8.6652 4.0584 0.2160 8.0964 0.0800 0.3703 133.0809 60.2617 10.8212 5.8969 18.4341 35.0489 18.6833 40.4796 11.2054 42.6336 1.5460 34.4945 24.3795 24.6933 209.8981 10.5938 1.9531 99.4831 6.7146 33.2873 105.8369 46.5179 11.6042 26.7140 17.8468 6.2231 5.6416 81.6101 201.0238 17.3576 92.9420 70.8799 0.9573 15.4634 47.0410 10.1877 50.2087 27.3574 4.2648 0.3985 54.9366 27.6033 25.7815 71.0399 26.1905 140.4464 1.3451 45.3969 71.8181 80.6103 116.1033 265.2414 56.4626 109.2927 44.3709 134.4689 50.4939 69.4001 31.3501 18.6825 43.6165 9.6964 36.1800 36.7922 4.1962 5.8532 9.5651 8.3738 3.6309 21.8272 3.0391 0.2817 1.6508
temp: 298.150 k
press: 1.00000 atm
elementType: 17 8 8 8 7 7 7 6 6 6 6 6 6 6 6 6 6 6 6 6 6 6 6 6 6 6 6 1 1 1 1 1 1 1 1 1 1 1 1 1 1 1 1 1 1 1 1
symmnumber: 1
zpe: 964050.3 jmol-1
zpe.correction: 0.367187 hartree
zpe.thermalcorrener: 0.390561 hartree
zpe.thermalcorrenthalpy: 0.391505 hartree
zpe.thermalcorrgfe: 0.311674 hartree
zpe.sumelectzpe: -1622.151127 hartree
zpe.sumelectthermal: -1622.127753 hartree
zpe.sumelectthermalent: -1622.126809 hartree
zpe.sumelectthermalfe: -1622.206640 hartree
dipole: -0.4943 0.3074 -1.5481
dipole: 1.6539
quadrupole: -192.4774 -156.6309 -160.6606
quadrupole: 6.8160 -6.5140 -12.8333
quadrupole: -22.5544 13.2921 9.2624 6.8160 -6.5140 -12.8333
hfenergy: -1622.5183144 hartree
pointgroup: C01 [X(C20H20Cl1N3O3)]
dipole: 0.1487814 -0.1727233 -0.609441 debye
polarizability: 272.3761923|25.5936827|346.5077079|19.2378295|-15.0002957|174.6924046 unknown
InChI: InChI=1S/C20H20ClN3O3/c21-15-4-3-5-16(12-15)23-14-24(18-7-2-1-6-17(18)20(23)26)19(25)13-22-8-10-27-11-9-22/h1-7,12H,8-11,13-14H2
charge 0 multiplicity 1
47 atoms
Cl 3.275544 4.223593 -1.976951
O  -5.635033 3.004577 0.255288
O  -2.702141 -1.335768 0.387806
O  3.26192 -1.998935 0.731243
N  -3.197195 1.431236 0.191269
N  -0.565912 -1.197927 -0.540873
N  1.745748 -0.490025 -0.260259
C  -1.941623 0.896281 -0.339876
C  -4.402725 1.008547 -0.571113
C  -3.156181 2.910334 0.33755
C  0.544385 -0.429751 -1.130138
C  -1.792307 -0.627692 -0.119062
C  -0.224633 -2.580569 -0.344621
C  -5.666795 1.536595 0.122886
C  -4.443699 3.398948 1.022278
C  1.152375 -2.865342 -0.093751
C  2.154375 -1.780225 0.15781
C  2.512253 0.697254 -0.009746
C  -1.16494 -3.636457 -0.412099
C  1.573711 -4.209645 0.053332
C  -0.722597 -4.96793 -0.265108
C  0.644786 -5.262038 -0.040427
C  2.543691 1.729801 -0.98586
C  3.222873 0.86467 1.209141
C  3.257322 2.909319 -0.709018
C  3.938663 2.055361 1.442923
C  3.962547 3.10292 0.491267
H  -1.816408 1.109736 -1.437973
H  -1.108868 1.409815 0.180183
H  -4.436006 -0.092972 -0.596102
H  -4.368045 1.39802 -1.620971
H  -2.284009 3.189797 0.959527
H  -3.056391 3.422868 -0.653067
H  0.776317 -0.864959 -2.123024
H  0.258048 0.618692 -1.263295
H  -5.756455 1.071315 1.127137
H  -6.567244 1.314507 -0.472732
H  -4.471849 4.500108 1.071014
H  -4.498996 2.976337 2.048397
H  -2.220493 -3.414569 -0.569278
H  2.631469 -4.3921 0.267884
H  -1.453285 -5.781538 -0.329544
H  0.974399 -6.299822 0.071123
H  2.063315 1.611437 -1.961284
H  3.22388 0.064715 1.95045
H  4.482986 2.177717 2.384973
H  4.512423 4.029167 0.676992
