program: Orca
programVersion: 4.2.1
elementType: Si F F N N N C C C C C C C C C C C C C C C C H H H H H H H H H H H H H H H
charge: 0
multiplicity: 1
keywords: wb97x-d3
keywords: def2-TZVPP
keywords: def2/J RIJCOSX GRIDX6 NOFINALGRIDX
keywords: grid4 nofinalgrid
keywords: scfconv7
keywords: smallprint printgap noloewdin
keywords: NOSOSCF
formula: C16H15F2N3Si
InChI: InChI=1/C16H15F2N3Si/c1-22(12-21-11-19-10-20-21,15-6-2-13(17)3-7-15)16-8-4-14(18)5-9-16/h2-11H,12H2,1H3
37 atoms
Si -0.153708 0.514042 1.436675
F  4.809165 -0.240594 -1.815773
F  -4.175698 -3.811058 0.408826
N  -0.524241 2.33946 -0.629303
N  0.569002 2.958833 -1.074191
N  -0.54292 2.021318 -2.782478
C  -0.790209 2.196386 0.788586
C  1.415214 0.15631 0.479112
C  -1.422361 -0.816331 1.057303
C  0.160968 0.652409 3.276057
C  2.660026 0.569414 0.956423
C  -2.774302 -0.525592 0.865361
C  1.360903 -0.41172 -0.795816
C  -1.036267 -2.159731 1.023538
C  3.811884 0.435241 0.194756
C  -3.711892 -1.525056 0.643827
C  2.496209 -0.5496 -1.580013
C  -1.953639 -3.176949 0.807393
C  -1.163938 1.77538 -1.650687
C  3.70265 -0.11726 -1.065868
C  -3.279353 -2.835588 0.620442
C  0.509683 2.740368 -2.364059
H  -1.855527 2.348429 0.969359
H  -0.27624 3.008647 1.301839
H  0.525253 -0.289775 3.688756
H  0.896034 1.425359 3.507718
H  -0.758651 0.908762 3.805665
H  2.750343 1.013149 1.940636
H  -3.126457 0.498489 0.888445
H  0.417773 -0.756527 -1.203039
H  0.002336 -2.434471 1.166286
H  4.772442 0.759033 0.573219
H  -4.756087 -1.28502 0.493449
H  2.441354 -0.985513 -2.56881
H  -1.642107 -4.212872 0.784064
H  -2.080157 1.217314 -1.534088
H  1.262093 3.129657 -3.03197
elementType: Si F N C H
totalener: -1272.29162314 hartree
nucrepener: 1902.44466122 hartree
electener: -3174.73628436 hartree
oneelecener: -5523.06199133 hartree
twoeener: 2348.32570697 hartree
cpcmener: -0.03070469 hartree
kineticenergy: 1267.72012283 hartree
xcener: -108.342497299049 hartree
chargesum: -0.0000000
charge: 0.445729 -0.224392 -0.222963 0.129815 -0.332007 -0.412523 -0.186139 -0.065345 -0.019009 -0.427050 -0.148001 -0.180723 -0.135667 -0.158200 -0.226638 -0.218220 -0.240250 -0.226930 0.033134 0.317996 0.315059 0.048650 0.139100 0.125728 0.112962 0.107499 0.114194 0.143586 0.153293 0.144913 0.143444 0.152291 0.153803 0.152354 0.153601 0.178380 0.158525
qa: 0.4457 -0.2244 -0.2230 0.1298 -0.3320 -0.4125 -0.1861 -0.0653 -0.0190 -0.4270 -0.1480 -0.1807 -0.1357 -0.1582 -0.2266 -0.2182 -0.2403 -0.2269 0.0331 0.3180 0.3151 0.0487 0.1391 0.1257 0.1130 0.1075 0.1142 0.1436 0.1533 0.1449 0.1434 0.1523 0.1538 0.1524 0.1536 0.1784 0.1585
va: 4.1122 1.0528 1.0551 3.3956 2.8890 3.0158 3.7795 3.6539 3.6436 3.9275 3.8669 3.8296 3.7972 3.8658 3.9209 3.9147 3.9458 3.9212 4.0677 3.8772 3.8809 4.0556 0.9996 1.0160 1.0101 1.0105 1.0082 0.9918 0.9908 0.9908 0.9967 0.9968 0.9968 0.9975 0.9962 0.9947 0.9983
dispcorr: -0.019808763 hartree
energy: -1272.311431903299
dipole: -1.88657 1.02641 -0.86016 7.79389 -7.75672 0.03718 11.28245 -9.07227 2.21018
magnitude: 2.37195 au
magnitude: 6.02903 debye
