program: Orca
programVersion: 4.2.1
elementType: Si F F N N N C C C C C C C C C C C C C C C C H H H H H H H H H H H H H H H
charge: 0
multiplicity: 1
keywords: wb97x-d3
keywords: def2-TZVPP
keywords: def2/J RIJCOSX GRIDX6 NOFINALGRIDX
keywords: grid4 nofinalgrid
keywords: scfconv7
keywords: smallprint printgap noloewdin
keywords: NOSOSCF
formula: C16H15F2N3Si
InChI: InChI=1/C16H15F2N3Si/c1-22(12-21-11-19-10-20-21,15-6-2-13(17)3-7-15)16-8-4-14(18)5-9-16/h2-11H,12H2,1H3
37 atoms
Si -0.578665 0.355664 0.783581
F  4.880058 -0.423451 -1.566426
F  -3.735942 -4.735893 0.557769
N  -0.518729 2.768885 -0.567094
N  -0.133526 3.570692 0.425187
N  0.907281 4.13075 -1.474151
C  -1.419095 1.662206 -0.329359
C  1.134161 0.084456 0.068684
C  -1.573863 -1.231886 0.672246
C  -0.472072 0.943598 2.557284
C  1.339921 -0.782421 -1.007313
C  -1.040065 -2.428022 1.161709
C  2.237129 0.785546 0.560816
C  -2.865903 -1.266252 0.144442
C  2.595727 -0.959387 -1.56891
C  -1.757917 -3.61377 1.128618
C  3.503205 0.626735 0.016003
C  -3.605032 -2.440649 0.099946
C  0.114187 3.104948 -1.689982
C  3.657047 -0.250381 -1.039277
C  -3.032517 -3.594515 0.59529
C  0.718331 4.373688 -0.166273
H  -1.666766 1.228918 -1.299682
H  -2.348781 2.047316 0.093941
H  0.058166 1.892002 2.646532
H  -1.471769 1.091524 2.97116
H  0.037596 0.210531 3.185915
H  0.511208 -1.343148 -1.424024
H  -0.039266 -2.451419 1.577988
H  2.123607 1.47191 1.391119
H  -3.327226 -0.367333 -0.246646
H  2.748219 -1.63802 -2.398326
H  -1.334932 -4.534367 1.509546
H  4.352025 1.172563 0.406656
H  -4.605611 -2.455148 -0.312329
H  -0.033764 2.587349 -2.62475
H  1.215361 5.16774 0.369604
elementType: Si F N C H
totalener: -1272.30318799 hartree
nucrepener: 1865.89918019 hartree
electener: -3138.20236818 hartree
oneelecener: -5449.83702752 hartree
twoeener: 2311.63465934 hartree
cpcmener: -0.02552219 hartree
kineticenergy: 1267.68097879 hartree
xcener: -108.334605439664 hartree
chargesum: -0.0000000
charge: 0.512241 -0.222153 -0.220977 0.129396 -0.356761 -0.408192 -0.177119 -0.099879 -0.133875 -0.383874 -0.137958 -0.160726 -0.111967 -0.151521 -0.224602 -0.216552 -0.226574 -0.213150 0.054478 0.315543 0.306313 0.061724 0.120010 0.130068 0.102955 0.114504 0.115021 0.139700 0.138659 0.137779 0.136889 0.150537 0.150860 0.150231 0.150067 0.170305 0.158596
qa: 0.5122 -0.2222 -0.2210 0.1294 -0.3568 -0.4082 -0.1771 -0.0999 -0.1339 -0.3839 -0.1380 -0.1607 -0.1120 -0.1515 -0.2246 -0.2166 -0.2266 -0.2131 0.0545 0.3155 0.3063 0.0617 0.1200 0.1301 0.1030 0.1145 0.1150 0.1397 0.1387 0.1378 0.1369 0.1505 0.1509 0.1502 0.1501 0.1703 0.1586
va: 4.0468 1.0567 1.0578 3.3830 2.8494 3.0240 3.8086 3.6974 3.7537 3.8743 3.8450 3.8667 3.7951 3.8657 3.9238 3.9168 3.9451 3.9161 4.0460 3.8849 3.8894 4.0378 1.0018 1.0036 1.0269 1.0082 1.0073 0.9958 1.0000 0.9955 0.9985 0.9974 0.9976 0.9981 0.9989 0.9951 0.9964
dispcorr: -0.018553750 hartree
energy: -1272.321741744860
dipole: -4.55981 3.36703 -1.19278 8.53562 -9.33874 -0.80312 6.34453 -6.18428 0.16025
magnitude: 1.44686 au
magnitude: 3.67763 debye
