program: Orca
programVersion: 4.2.1
elementType: Si F F N N N C C C C C C C C C C C C C C C C H H H H H H H H H H H H H H H
charge: 0
multiplicity: 1
keywords: wb97x-d3
keywords: def2-TZVPP
keywords: def2/J RIJCOSX GRIDX6 NOFINALGRIDX
keywords: grid4 nofinalgrid
keywords: scfconv7
keywords: smallprint printgap noloewdin
keywords: NOSOSCF
formula: C16H15F2N3Si
InChI: InChI=1/C16H15F2N3Si/c1-22(12-21-11-19-10-20-21,15-6-2-13(17)3-7-15)16-8-4-14(18)5-9-16/h2-11H,12H2,1H3
37 atoms
Si -0.516855 0.383633 0.630639
F  5.109957 -0.686456 -1.118514
F  -3.6288 -4.736561 0.842121
N  -0.741525 2.791039 -0.812416
N  0.016735 3.010693 -1.885154
N  0.04045 4.798273 -0.540234
C  -1.414018 1.524402 -0.608399
C  1.242207 0.082133 0.063343
C  -1.482975 -1.226752 0.665043
C  -0.529277 1.170318 2.332868
C  2.25355 -0.140283 1.001584
C  -0.868228 -2.459422 0.438579
C  1.587725 0.040042 -1.289871
C  -2.851857 -1.223601 0.950738
C  3.560347 -0.402635 0.616924
C  -1.580554 -3.649526 0.497219
C  2.887952 -0.216844 -1.699011
C  -3.586007 -2.398506 1.009495
C  -0.71647 3.860762 -0.016258
C  3.850335 -0.435522 -0.73263
C  -2.92988 -3.593243 0.782464
C  0.464195 4.22557 -1.680488
H  -1.514177 1.044672 -1.581931
H  -2.432142 1.72125 -0.265101
H  -1.544167 1.438112 2.634452
H  -0.148202 0.478508 3.086898
H  0.082386 2.072958 2.382371
H  2.032925 -0.112085 2.062107
H  0.190397 -2.507638 0.212826
H  0.84123 0.214298 -2.054464
H  -3.373267 -0.29126 1.137072
H  4.335702 -0.575535 1.352015
H  -1.094475 -4.601122 0.324342
H  3.148444 -0.243707 -2.749214
H  -4.645696 -2.386184 1.229568
H  -1.261954 3.917042 0.913143
H  1.116625 4.717661 -2.385225
elementType: Si F N C H
totalener: -1272.30201906 hartree
nucrepener: 1846.60081804 hartree
electener: -3118.90283710 hartree
oneelecener: -5411.12452955 hartree
twoeener: 2292.22169245 hartree
cpcmener: -0.02642422 hartree
kineticenergy: 1267.67791925 hartree
xcener: -108.333061928716 hartree
chargesum: -0.0000000
charge: 0.473132 -0.220877 -0.221024 0.117238 -0.352502 -0.421306 -0.200775 -0.113754 -0.104589 -0.430263 -0.098611 -0.115323 -0.117248 -0.147205 -0.242728 -0.222505 -0.229972 -0.224831 0.058984 0.325101 0.309432 0.063032 0.127776 0.140599 0.121381 0.118195 0.122572 0.138555 0.143581 0.127309 0.134910 0.149890 0.150990 0.150093 0.149911 0.179162 0.161670
qa: 0.4731 -0.2209 -0.2210 0.1172 -0.3525 -0.4213 -0.2008 -0.1138 -0.1046 -0.4303 -0.0986 -0.1153 -0.1172 -0.1472 -0.2427 -0.2225 -0.2300 -0.2248 0.0590 0.3251 0.3094 0.0630 0.1278 0.1406 0.1214 0.1182 0.1226 0.1386 0.1436 0.1273 0.1349 0.1499 0.1510 0.1501 0.1499 0.1792 0.1617
va: 4.0999 1.0586 1.0576 3.3796 2.8685 3.0313 3.8023 3.7822 3.7490 3.9045 3.8257 3.8191 3.8095 3.8728 3.9410 3.9241 3.9323 3.9281 4.0422 3.8772 3.8875 4.0411 1.0113 1.0023 1.0033 1.0102 1.0031 0.9933 0.9908 1.0159 0.9976 0.9989 0.9978 0.9978 0.9987 0.9870 0.9947
dispcorr: -0.017881611 hartree
energy: -1272.319900667054
dipole: -5.28672 4.12253 -1.16419 9.53097 -10.20912 -0.67814 6.05527 -5.04860 1.00667
magnitude: 1.68184 au
magnitude: 4.27490 debye
