program: Orca
programVersion: 4.2.1
elementType: Si F F N N N C C C C C C C C C C C C C C C C H H H H H H H H H H H H H H H
charge: 0
multiplicity: 1
keywords: wb97x-d3
keywords: def2-TZVPP
keywords: def2/J RIJCOSX GRIDX6 NOFINALGRIDX
keywords: grid4 nofinalgrid
keywords: scfconv7
keywords: smallprint printgap noloewdin
keywords: NOSOSCF
formula: C16H15F2N3Si
InChI: InChI=1/C16H15F2N3Si/c1-22(12-21-11-19-10-20-21,15-6-2-13(17)3-7-15)16-8-4-14(18)5-9-16/h2-11H,12H2,1H3
37 atoms
Si 0.273383 0.467635 1.301443
F  5.53111 -1.0472 -1.138182
F  -4.183695 -3.079875 -0.531344
N  -1.039816 2.391794 -0.281812
N  -0.591396 1.917684 -1.443344
N  -2.641264 2.774767 -1.702417
C  -0.250569 2.274679 0.919409
C  1.906434 0.022671 0.497905
C  -1.109065 -0.659309 0.737051
C  0.459391 0.381009 3.173802
C  2.735759 -0.914381 1.120552
C  -1.038289 -1.332976 -0.483207
C  2.347212 0.578926 -0.705787
C  -2.258387 -0.831436 1.510374
C  3.955918 -1.285481 0.578775
C  -2.067989 -2.151248 -0.919616
C  3.567264 0.225508 -1.262619
C  -3.302057 -1.642787 1.093671
C  -2.267179 2.894439 -0.451552
C  4.353669 -0.702196 -0.608673
C  -3.186002 -2.2916 -0.120463
C  -1.581401 2.172411 -2.268684
H  -0.861398 2.638776 1.748082
H  0.615651 2.93845 0.855923
H  -0.458035 0.677983 3.684993
H  0.69815 -0.627085 3.51443
H  1.25426 1.041708 3.523649
H  2.43507 -1.375684 2.053566
H  -0.161543 -1.22319 -1.109034
H  1.721979 1.288816 -1.231997
H  -2.353552 -0.331891 2.467777
H  4.589817 -2.012467 1.06856
H  -2.006825 -2.673317 -1.865067
H  3.902604 0.662826 -2.193666
H  -4.189455 -1.773651 1.698329
H  -2.841893 3.332032 0.350188
H  -1.533807 1.909807 -3.3137
totalener: -1272.27901618 hartree
nucrepener: 1880.03773921 hartree
electener: -3152.31675539 hartree
oneelecener: -5478.25923397 hartree
twoeener: 2325.94247859 hartree
kineticenergy: 1267.68219565 hartree
xcener: -108.334932760830 hartree
chargesum: 0.0000000
charge: 0.461671 -0.200905 -0.200327 0.159157 -0.348201 -0.334318 -0.227664 -0.101533 -0.090458 -0.440417 -0.097333 -0.063942 -0.111190 -0.089906 -0.208738 -0.199991 -0.203230 -0.206756 0.046706 0.298543 0.304078 0.077652 0.095664 0.124819 0.091925 0.100902 0.112803 0.109193 0.120514 0.152696 0.108547 0.124296 0.124745 0.125371 0.122710 0.133781 0.129136
qa: 0.4617 -0.2009 -0.2003 0.1592 -0.3482 -0.3343 -0.2277 -0.1015 -0.0905 -0.4404 -0.0973 -0.0639 -0.1112 -0.0899 -0.2087 -0.2000 -0.2032 -0.2068 0.0467 0.2985 0.3041 0.0777 0.0957 0.1248 0.0919 0.1009 0.1128 0.1092 0.1205 0.1527 0.1085 0.1243 0.1247 0.1254 0.1227 0.1338 0.1291
va: 4.0946 1.0883 1.0900 3.3232 2.8500 3.0655 3.8094 3.8503 3.7860 3.9314 3.8782 3.8261 3.7750 3.8361 3.9563 3.9415 3.9569 3.9686 4.0619 3.9562 3.9583 4.0473 1.0092 0.9954 1.0172 1.0168 1.0097 1.0024 0.9997 1.0274 0.9982 1.0068 1.0056 1.0070 1.0069 1.0026 1.0015
dispcorr: -0.018570148 hartree
energy: -1272.297586327401
dipole: -0.58266 0.89215 0.30949 8.06029 -7.70623 0.35406 11.93578 -10.52685 1.40893
magnitude: 1.48534 au
magnitude: 3.77543 debye
