program: Orca
programVersion: 5.0.2
elementType: S O O N N N C C C C C C C C C C C C C C C C C H H H H H H H H H H H H H H H H H H H H H
charge: 0
multiplicity: 1
keywords: wb97x-d3
keywords: def2-TZVPP
keywords: def2/J RIJCOSX
keywords: DEFGRID2
keywords: scfconv7
keywords: smallprint printgap noloewdin
keywords: NOSOSCF
formula: C17H21N3O2S
InChI: InChI=1/C17H21N3O2S/c1-5-10-23-17(22)20-15(18)14(16(21)19(20)11(2)3)13-9-7-6-8-12(13)4/h5-9,11H,1,10,18H2,2-4H3
44 atoms
S  2.956966 0.239471 -0.613999
O  -1.192784 -2.181609 -0.979378
O  2.041348 1.841888 1.264861
N  0.595769 -1.089994 0.000506
N  0.698618 0.080253 0.757053
N  -0.752675 1.79039 1.539713
C  1.251364 -2.252601 0.662135
C  -1.468446 -0.098384 0.172395
C  -0.765039 -1.219723 -0.350953
C  -0.563423 0.66584 0.867381
C  -2.911123 0.127124 0.019555
C  1.650022 -3.307096 -0.353762
C  0.42182 -2.811901 1.807595
C  -3.417496 1.24525 -0.660714
C  1.849023 0.846668 0.607463
C  -3.797492 -0.819369 0.539109
C  -4.800379 1.385651 -0.77556
C  -2.520066 2.282557 -1.268628
C  -5.16761 -0.667903 0.409756
C  -5.67159 0.445199 -0.249573
C  4.333613 1.416036 -0.376268
C  5.460662 0.963506 -1.244468
C  5.881103 1.641915 -2.304365
H  2.174629 -1.85018 1.080233
H  2.302073 -4.033329 0.131691
H  0.797729 -3.850014 -0.75624
H  2.204441 -2.867708 -1.182889
H  -0.492816 -3.291788 1.459111
H  0.153181 -2.036723 2.526889
H  1.003983 -3.563134 2.341785
H  -3.401042 -1.679685 1.064155
H  -1.665485 2.21479 1.541249
H  -0.01096 2.248776 2.04077
H  -5.198007 2.245911 -1.300929
H  -2.285722 3.08018 -0.560355
H  -1.5739 1.859204 -1.60439
H  -3.000658 2.754686 -2.124691
H  -5.837216 -1.411443 0.821884
H  -6.740145 0.57845 -0.358586
H  4.005382 2.419125 -0.643788
H  4.622831 1.400462 0.675117
H  5.945621 0.033863 -0.965576
H  6.713028 1.292884 -2.901356
H  5.415568 2.57227 -2.607175
elementType: S O N C H
totalener: -1373.45412898 hartree
nucrepener: 2123.03768436 hartree
electener: -3496.49181335 hartree
oneelecener: -6096.01944307 hartree
twoeener: 2599.52762973 hartree
cpcmener: -0.04661018 hartree
kineticenergy: 1368.49986926 hartree
xcener: -114.174563787553 hartree
chargesum: -0.0000000
charge: -0.034632 -0.562448 -0.457085 -0.084341 -0.043483 -0.237468 0.093424 -0.007359 0.261455 0.227086 0.054442 -0.268843 -0.290988 -0.143172 0.338796 -0.255410 -0.120578 -0.271789 -0.175843 -0.167756 -0.047505 -0.216628 -0.250613 0.068847 0.105543 0.089029 0.093041 0.091662 0.101950 0.109133 0.147234 0.211157 0.204312 0.140723 0.107772 0.110900 0.105017 0.158586 0.159510 0.116442 0.127071 0.156609 0.135047 0.121154
qa: -0.0346 -0.5624 -0.4571 -0.0843 -0.0435 -0.2375 0.0934 -0.0074 0.2615 0.2271 0.0544 -0.2688 -0.2910 -0.1432 0.3388 -0.2554 -0.1206 -0.2718 -0.1758 -0.1678 -0.0475 -0.2166 -0.2506 0.0688 0.1055 0.0890 0.0930 0.0917 0.1020 0.1091 0.1472 0.2112 0.2043 0.1407 0.1078 0.1109 0.1050 0.1586 0.1595 0.1164 0.1271 0.1566 0.1350 0.1212
va: 2.4626 1.9492 2.0486 2.8792 3.2122 3.3312 3.8619 3.1682 4.3058 4.1400 3.3546 3.9065 3.9517 3.8035 4.2384 3.9936 3.8617 3.9193 3.9100 3.9091 3.8972 3.8440 3.9494 1.0189 1.0025 1.0199 1.0080 1.0089 1.0035 1.0041 1.0077 0.9902 1.0187 1.0001 0.9956 0.9954 1.0035 0.9929 0.9898 1.0157 1.0088 0.9991 1.0015 1.0089
dispcorr: -0.022814774 hartree
energy: -1373.476943756650
dipole: 4.85195 -3.52547 1.32649 -2.33328 4.52187 2.18860 -0.35660 2.01782 1.66122
magnitude: 3.05109 au
magnitude: 7.75525 debye
