program: Orca
programVersion: 5.0.2
elementType: S O O N N N C C C C C C C C C C C C C C C C C H H H H H H H H H H H H H H H H H H H H H
charge: 0
multiplicity: 1
keywords: wb97x-d3
keywords: def2-TZVPP
keywords: def2/J RIJCOSX
keywords: DEFGRID2
keywords: scfconv7
keywords: smallprint printgap noloewdin
keywords: NOSOSCF
formula: C17H21N3O2S
InChI: InChI=1/C17H21N3O2S/c1-5-10-23-17(22)20-15(18)14(16(21)19(20)11(2)3)13-9-7-6-8-12(13)4/h5-9,11H,1,10,18H2,2-4H3
44 atoms
S  2.903546 0.076212 -1.126039
O  -1.250491 -2.352275 -0.602466
O  2.06765 2.08988 0.357585
N  0.598711 -1.067981 -0.068808
N  0.744011 0.244946 0.38772
N  -0.668075 2.08018 0.919606
C  1.324799 -2.051356 0.784543
C  -1.465406 -0.069386 0.092613
C  -0.788537 -1.274775 -0.245637
C  -0.515723 0.835059 0.498074
C  -2.923008 0.105698 0.064573
C  1.648632 -3.312401 0.005283
C  0.602922 -2.331876 2.093309
C  -3.54319 1.030501 -0.788987
C  1.860411 0.961529 -0.02152
C  -3.70918 -0.695971 0.89607
C  -4.933797 1.137212 -0.758752
C  -2.757564 1.900689 -1.724981
C  -5.089002 -0.581365 0.909228
C  -5.703903 0.345875 0.078366
C  4.29099 1.254031 -1.251979
C  5.177166 1.223739 -0.053339
C  6.434641 0.800084 -0.081996
H  2.274268 -1.570017 1.019567
H  2.342792 -3.917365 0.588315
H  0.769407 -3.921366 -0.19334
H  2.129734 -3.079027 -0.944577
H  1.241967 -2.935859 2.737421
H  -0.325447 -2.884457 1.942234
H  0.373224 -1.412034 2.633059
H  -3.223516 -1.407841 1.552312
H  -1.584846 2.496828 0.902099
H  0.112989 2.655292 1.186895
H  -5.419209 1.84925 -1.415821
H  -1.829217 1.426797 -2.043714
H  -3.339527 2.134634 -2.616578
H  -2.493008 2.854712 -1.261955
H  -5.679912 -1.207703 1.564608
H  -6.781378 0.449278 0.078396
H  4.828026 0.939045 -2.147893
H  3.885882 2.247272 -1.444012
H  4.75055 1.580289 0.878005
H  7.048098 0.803309 0.809899
H  6.897174 0.438168 -0.992834
elementType: S O N C H
totalener: -1373.45478496 hartree
nucrepener: 2132.00165495 hartree
electener: -3505.45643991 hartree
oneelecener: -6113.90814390 hartree
twoeener: 2608.45170399 hartree
cpcmener: -0.04579002 hartree
kineticenergy: 1368.49680982 hartree
xcener: -114.174612182604 hartree
chargesum: -0.0000000
charge: -0.037948 -0.559887 -0.463442 -0.083377 -0.044204 -0.237552 0.096706 -0.009206 0.260844 0.225531 0.053752 -0.270100 -0.291592 -0.142615 0.339245 -0.256826 -0.118487 -0.274800 -0.173203 -0.168065 -0.036208 -0.207714 -0.268425 0.068169 0.104830 0.089300 0.093047 0.110111 0.090582 0.102294 0.147440 0.211274 0.205001 0.140768 0.111864 0.106408 0.108037 0.157711 0.159423 0.131250 0.125037 0.150887 0.133642 0.120498
qa: -0.0379 -0.5599 -0.4634 -0.0834 -0.0442 -0.2376 0.0967 -0.0092 0.2608 0.2255 0.0538 -0.2701 -0.2916 -0.1426 0.3392 -0.2568 -0.1185 -0.2748 -0.1732 -0.1681 -0.0362 -0.2077 -0.2684 0.0682 0.1048 0.0893 0.0930 0.1101 0.0906 0.1023 0.1474 0.2113 0.2050 0.1408 0.1119 0.1064 0.1080 0.1577 0.1594 0.1313 0.1250 0.1509 0.1336 0.1205
va: 2.4399 1.9522 2.0366 2.8727 3.2234 3.3298 3.8550 3.1758 4.3094 4.1476 3.3560 3.9078 3.9508 3.8004 4.2164 3.9938 3.8608 3.9193 3.9090 3.9087 3.8278 3.8160 3.9634 1.0209 1.0027 1.0202 1.0081 1.0041 1.0088 1.0029 1.0069 0.9902 1.0195 0.9999 0.9950 1.0028 0.9947 0.9932 0.9899 1.0126 1.0237 1.0020 1.0011 1.0087
dispcorr: -0.023252605 hartree
energy: -1373.478037565809
dipole: 5.51349 -4.13968 1.37381 -2.58705 5.08508 2.49803 3.51813 -2.54423 0.97390
magnitude: 3.01264 au
magnitude: 7.65752 debye
