program: Orca
programVersion: 5.0.2
elementType: S O O N N N C C C C C C C C C C C C C C C C C H H H H H H H H H H H H H H H H H H H H H
charge: 0
multiplicity: 1
keywords: wb97x-d3
keywords: def2-TZVPP
keywords: def2/J RIJCOSX
keywords: DEFGRID2
keywords: scfconv7
keywords: smallprint printgap noloewdin
keywords: NOSOSCF
formula: C17H21N3O2S
InChI: InChI=1/C17H21N3O2S/c1-5-10-23-17(22)20-15(18)14(16(21)19(20)11(2)3)13-9-7-6-8-12(13)4/h5-9,11H,1,10,18H2,2-4H3
44 atoms
S  2.974079 0.113495 1.312114
O  -1.298998 -2.133049 1.136069
O  2.251823 1.942029 -0.448689
N  0.59996 -1.02717 0.415413
N  0.803364 0.213137 -0.194994
N  -0.511171 2.085493 -0.835522
C  1.256271 -2.140064 -0.328586
C  -1.416036 0.040948 0.137355
C  -0.791052 -1.136946 0.63512
C  -0.423351 0.856206 -0.353271
C  -2.86236 0.277191 0.168906
C  0.495038 -2.526139 -1.587521
C  1.533366 -3.320011 0.584704
C  -3.606547 0.505278 -0.999952
C  1.976416 0.899145 0.092315
C  -3.521751 0.217711 1.399852
C  -4.982731 0.702052 -0.885915
C  -2.972341 0.525684 -2.359338
C  -4.891226 0.399025 1.491553
C  -5.625556 0.65138 0.340717
C  4.47341 1.14351 1.192694
C  5.263587 0.83646 -0.032408
C  5.55166 1.726872 -0.973329
H  2.224429 -1.740046 -0.630359
H  0.31034 -1.662382 -2.228376
H  1.088409 -3.236053 -2.163938
H  -0.460355 -3.001838 -1.36439
H  0.631053 -3.858252 0.866621
H  2.046892 -3.003993 1.492723
H  2.184809 -4.021578 0.063489
H  -2.945786 0.038522 2.299177
H  -1.405735 2.548458 -0.837179
H  0.283057 2.573532 -1.21294
H  -5.561799 0.88242 -1.783915
H  -3.697384 0.255992 -3.126467
H  -2.591692 1.51619 -2.617491
H  -2.134764 -0.16939 -2.429495
H  -5.381602 0.346307 2.454687
H  -6.696232 0.799636 0.396484
H  4.208849 2.196914 1.272717
H  5.031413 0.875417 2.092657
H  5.620031 -0.184191 -0.124306
H  6.145305 1.456489 -1.836809
H  5.213218 2.753818 -0.914412
elementType: S O N C H
totalener: -1373.45550910 hartree
nucrepener: 2140.13248451 hartree
electener: -3513.58799360 hartree
oneelecener: -6130.32408366 hartree
twoeener: 2616.73609006 hartree
cpcmener: -0.04673942 hartree
kineticenergy: 1368.49872297 hartree
xcener: -114.176149950473 hartree
chargesum: -0.0000000
charge: -0.043293 -0.565379 -0.455869 -0.080658 -0.027825 -0.246818 0.093675 -0.001989 0.270422 0.224630 0.037255 -0.294735 -0.270167 -0.149527 0.335260 -0.243720 -0.124376 -0.260554 -0.176826 -0.168401 -0.034304 -0.203701 -0.265847 0.067396 0.098693 0.111108 0.094680 0.089530 0.093366 0.104711 0.144713 0.209808 0.205957 0.139980 0.105262 0.106301 0.108056 0.157232 0.159619 0.116854 0.140854 0.145733 0.133862 0.119034
qa: -0.0433 -0.5654 -0.4559 -0.0807 -0.0278 -0.2468 0.0937 -0.0020 0.2704 0.2246 0.0373 -0.2947 -0.2702 -0.1495 0.3353 -0.2437 -0.1244 -0.2606 -0.1768 -0.1684 -0.0343 -0.2037 -0.2658 0.0674 0.0987 0.1111 0.0947 0.0895 0.0934 0.1047 0.1447 0.2098 0.2060 0.1400 0.1053 0.1063 0.1081 0.1572 0.1596 0.1169 0.1409 0.1457 0.1339 0.1190
va: 2.4323 1.9452 2.0462 2.8817 3.2204 3.3287 3.8609 3.1934 4.2796 4.1368 3.4052 3.9513 3.9072 3.8028 4.2234 3.9788 3.8696 3.9162 3.9104 3.9065 3.8233 3.8158 3.9540 1.0191 1.0053 1.0049 1.0075 1.0206 1.0082 1.0026 1.0109 0.9903 1.0186 1.0008 1.0035 0.9979 0.9943 0.9933 0.9898 1.0276 1.0051 1.0039 1.0019 1.0112
dispcorr: -0.023633866 hartree
energy: -1373.479142965350
dipole: 3.75538 -2.18547 1.56992 -4.91879 7.00717 2.08838 -10.69332 9.09598 -1.59734
magnitude: 3.06226 au
magnitude: 7.78365 debye
