program: Orca
programVersion: 5.0.2
elementType: S O O N N N C C C C C C C C C C C C C C C C C H H H H H H H H H H H H H H H H H H H H H
charge: 0
multiplicity: 1
keywords: wb97x-d3
keywords: def2-TZVPP
keywords: def2/J RIJCOSX
keywords: DEFGRID2
keywords: scfconv7
keywords: smallprint printgap noloewdin
keywords: NOSOSCF
formula: C17H21N3O2S
InChI: InChI=1/C17H21N3O2S/c1-5-10-23-17(22)20-15(18)14(16(21)19(20)11(2)3)13-9-7-6-8-12(13)4/h5-9,11H,1,10,18H2,2-4H3
44 atoms
S  2.946076 -0.04857 1.294737
O  -1.292979 -2.267956 0.719732
O  2.232356 2.025334 -0.17047
N  0.603177 -1.059467 0.18213
N  0.809965 0.256858 -0.238806
N  -0.515172 2.193456 -0.627771
C  1.288663 -2.060905 -0.680055
C  -1.409282 0.041991 0.083449
C  -0.789208 -1.207559 0.38042
C  -0.419199 0.914843 -0.291455
C  -2.844054 0.349894 0.168596
C  0.559002 -2.308624 -1.991565
C  1.565649 -3.337745 0.092983
C  -3.774398 -0.253358 -0.692697
C  1.964188 0.906061 0.187103
C  -3.284916 1.284706 1.106617
C  -5.118128 0.094261 -0.570215
C  -3.35304 -1.247599 -1.732525
C  -4.624743 1.626016 1.20939
C  -5.546336 1.02346 0.366716
C  4.421995 1.019255 1.384037
C  5.239823 0.955391 0.140377
C  5.522281 2.007671 -0.616973
H  2.254954 -1.612311 -0.913409
H  -0.389755 -2.82583 -1.846511
H  0.371717 -1.379431 -2.532354
H  1.177395 -2.935474 -2.635434
H  2.24827 -3.961808 -0.484924
H  0.665563 -3.919926 0.279277
H  2.042046 -3.124143 1.04996
H  -2.564524 1.741894 1.774913
H  -1.40885 2.653228 -0.560105
H  0.283608 2.740419 -0.90237
H  -5.842698 -0.365873 -1.232001
H  -4.131862 -1.380695 -2.483078
H  -2.443376 -0.936495 -2.247579
H  -3.155598 -2.227186 -1.294153
H  -4.944599 2.352568 1.945248
H  -6.596771 1.277038 0.434349
H  4.130412 2.035729 1.645881
H  4.974138 0.607669 2.232641
H  5.621843 -0.0241 -0.129473
H  6.139253 1.911034 -1.501291
H  5.161329 3.001451 -0.38011
elementType: S O N C H
totalener: -1373.46385441 hartree
nucrepener: 2140.39434655 hartree
electener: -3513.85820097 hartree
oneelecener: -6130.89259713 hartree
twoeener: 2617.03439616 hartree
cpcmener: -0.03533333 hartree
kineticenergy: 1368.48960415 hartree
xcener: -114.170960467752 hartree
chargesum: -0.0000000
charge: -0.043293 -0.516548 -0.438686 -0.076742 -0.052158 -0.246826 0.105096 -0.003492 0.236324 0.240403 -0.002947 -0.306600 -0.268258 -0.130740 0.327171 -0.237988 -0.104152 -0.273271 -0.156309 -0.169458 -0.036631 -0.200025 -0.257187 0.065358 0.090937 0.102606 0.110497 0.102278 0.092323 0.091854 0.148385 0.204377 0.201950 0.137183 0.101068 0.103471 0.108506 0.154365 0.155794 0.114876 0.138588 0.142153 0.130653 0.115098
qa: -0.0433 -0.5165 -0.4387 -0.0767 -0.0522 -0.2468 0.1051 -0.0035 0.2363 0.2404 -0.0029 -0.3066 -0.2683 -0.1307 0.3272 -0.2380 -0.1042 -0.2733 -0.1563 -0.1695 -0.0366 -0.2000 -0.2572 0.0654 0.0909 0.1026 0.1105 0.1023 0.0923 0.0919 0.1484 0.2044 0.2019 0.1372 0.1011 0.1035 0.1085 0.1544 0.1558 0.1149 0.1386 0.1422 0.1307 0.1151
va: 2.4321 2.0050 2.0666 2.8707 3.2152 3.3023 3.8509 3.1181 4.3258 4.1418 3.4199 3.9574 3.9061 3.8077 4.2387 3.9351 3.8577 3.9163 3.8989 3.9244 3.8301 3.8183 3.9574 1.0193 1.0065 1.0014 1.0066 1.0029 1.0196 1.0088 1.0050 0.9968 1.0217 1.0020 1.0083 0.9942 1.0042 0.9936 0.9909 1.0280 1.0049 1.0043 1.0022 1.0122
dispcorr: -0.023919463 hartree
energy: -1373.487773875289
dipole: 3.40257 -2.01890 1.38367 -6.28876 8.26571 1.97694 -10.00417 8.93057 -1.07360
magnitude: 2.64111 au
magnitude: 6.71317 debye
