program: Orca
programVersion: 5.0.2
elementType: S O O N N N C C C C C C C C C C C C C C C C C H H H H H H H H H H H H H H H H H H H H H
charge: 0
multiplicity: 1
keywords: wb97x-d3
keywords: def2-TZVPP
keywords: def2/J RIJCOSX
keywords: DEFGRID2
keywords: scfconv7
keywords: smallprint printgap noloewdin
keywords: NOSOSCF
formula: C17H21N3O2S
InChI: InChI=1/C17H21N3O2S/c1-5-10-23-17(22)20-15(18)14(16(21)19(20)11(2)3)13-9-7-6-8-12(13)4/h5-9,11H,1,10,18H2,2-4H3
44 atoms
S  2.964604 0.525858 0.476945
O  -1.151401 -1.750195 1.636468
O  1.962692 1.487948 -1.761235
N  0.60457 -0.950802 0.361244
N  0.671053 -0.057162 -0.710234
N  -0.820425 1.353054 -1.91106
C  1.290994 -2.243973 0.089542
C  -1.486651 -0.100331 -0.068309
C  -0.749952 -1.003368 0.757894
C  -0.605935 0.446327 -0.965234
C  -2.940486 0.093803 0.006016
C  0.47633 -3.163402 -0.807577
C  1.72116 -2.905803 1.386448
C  -3.512151 1.333772 0.329096
C  1.805858 0.737738 -0.829973
C  -3.77085 -1.004883 -0.227649
C  -4.902743 1.434052 0.376842
C  -2.672632 2.539822 0.6328
C  -5.149219 -0.889562 -0.168625
C  -5.717853 0.341154 0.12966
C  4.296265 1.616532 -0.136207
C  5.409151 1.571544 0.858309
C  6.599002 1.042799 0.600991
H  2.2006 -1.972887 -0.447722
H  1.075885 -4.035177 -1.072641
H  -0.429224 -3.524939 -0.319446
H  0.194342 -2.671036 -1.73984
H  2.382754 -3.742013 1.156815
H  0.881209 -3.2959 1.957572
H  2.273374 -2.210465 2.019127
H  -3.323761 -1.960612 -0.472845
H  -1.766192 1.656927 -2.080693
H  -0.129363 1.565406 -2.611714
H  -5.352947 2.388049 0.625962
H  -2.384519 3.078259 -0.273823
H  -3.220564 3.245317 1.258041
H  -1.75275 2.275137 1.155483
H  -5.774723 -1.75279 -0.356294
H  -6.794179 0.448548 0.178254
H  4.625482 1.270002 -1.115244
H  3.900489 2.628359 -0.22945
H  5.211541 2.011193 1.831563
H  7.385187 1.039965 1.345156
H  6.830257 0.590724 -0.357301
elementType: S O N C H
totalener: -1373.46224172 hartree
nucrepener: 2120.97940656 hartree
electener: -3494.44164827 hartree
oneelecener: -6091.84753118 hartree
twoeener: 2597.40588291 hartree
cpcmener: -0.03692805 hartree
kineticenergy: 1368.48016158 hartree
xcener: -114.167823552343 hartree
chargesum: 0.0000000
charge: -0.036885 -0.514977 -0.438485 -0.084234 -0.050119 -0.255914 0.089760 -0.011517 0.236759 0.240228 0.062597 -0.289768 -0.266772 -0.144673 0.327302 -0.253052 -0.111680 -0.270484 -0.168485 -0.167231 -0.047030 -0.211498 -0.246839 0.067683 0.107202 0.092930 0.099614 0.101782 0.094583 0.091223 0.143432 0.206172 0.200665 0.137368 0.103555 0.103387 0.111405 0.154508 0.155864 0.111705 0.126950 0.153580 0.131793 0.117597
qa: -0.0369 -0.5150 -0.4385 -0.0842 -0.0501 -0.2559 0.0898 -0.0115 0.2368 0.2402 0.0626 -0.2898 -0.2668 -0.1447 0.3273 -0.2531 -0.1117 -0.2705 -0.1685 -0.1672 -0.0470 -0.2115 -0.2468 0.0677 0.1072 0.0929 0.0996 0.1018 0.0946 0.0912 0.1434 0.2062 0.2007 0.1374 0.1036 0.1034 0.1114 0.1545 0.1559 0.1117 0.1270 0.1536 0.1318 0.1176
va: 2.4563 2.0099 2.0691 2.8744 3.2130 3.3085 3.8691 3.1536 4.3367 4.1172 3.3618 3.9485 3.9033 3.8093 4.2559 4.0046 3.8598 3.9239 3.9151 3.9188 3.8993 3.8451 3.9548 1.0202 1.0043 1.0098 1.0040 1.0031 1.0207 1.0081 1.0078 0.9939 1.0184 1.0010 0.9975 1.0044 0.9949 0.9939 0.9909 1.0166 1.0079 0.9995 1.0022 1.0091
dispcorr: -0.022756871 hartree
energy: -1373.484998589910
dipole: 5.50194 -4.35921 1.14273 -3.55476 4.90978 1.35502 0.05689 -2.15718 -2.10029
magnitude: 2.74830 au
magnitude: 6.98562 debye
