program: Orca
programVersion: 5.0.2
elementType: S O O N N N C C C C C C C C C C C C C C C C C H H H H H H H H H H H H H H H H H H H H H
charge: 0
multiplicity: 1
keywords: wb97x-d3
keywords: def2-TZVPP
keywords: def2/J RIJCOSX
keywords: DEFGRID2
keywords: scfconv7
keywords: smallprint printgap noloewdin
keywords: NOSOSCF
formula: C17H21N3O2S
InChI: InChI=1/C17H21N3O2S/c1-5-10-23-17(22)20-15(18)14(16(21)19(20)11(2)3)13-9-7-6-8-12(13)4/h5-9,11H,1,10,18H2,2-4H3
44 atoms
S  2.973297 0.138911 -1.306033
O  -1.213998 -2.224888 -0.909325
O  2.200577 2.08819 0.297845
N  0.644807 -0.996997 -0.2924
N  0.808771 0.296463 0.207379
N  -0.566052 2.180228 0.673138
C  1.350067 -2.02949 0.515059
C  -1.402355 0.033208 -0.123556
C  -0.740803 -1.173111 -0.509441
C  -0.438079 0.915402 0.295237
C  -2.851003 0.246926 -0.197916
C  1.648283 -3.259469 -0.323581
C  0.627271 -2.353491 1.813314
C  -3.616905 0.565379 0.935852
C  1.955011 0.995303 -0.147847
C  -3.488174 0.09162 -1.431857
C  -4.990111 0.753267 0.781289
C  -3.006851 0.690043 2.300873
C  -4.855365 0.265865 -1.562734
C  -5.610369 0.607817 -0.449299
C  4.399084 1.249993 -1.314345
C  5.292634 1.187789 -0.116922
C  5.187453 0.392695 0.937866
H  2.310092 -1.57882 0.770443
H  0.758359 -3.845753 -0.541959
H  2.12226 -2.988431 -1.267268
H  2.340941 -3.900753 0.222444
H  -0.329392 -2.848516 1.643269
H  0.453809 -1.456958 2.411212
H  1.242358 -3.02578 2.412675
H  -2.896079 -0.157844 -2.303802
H  -1.454944 2.638383 0.552799
H  0.223082 2.741202 0.946611
H  -5.586319 1.003034 1.651367
H  -3.757121 0.530266 3.074988
H  -2.207398 -0.034806 2.457248
H  -2.580178 1.680744 2.473547
H  -5.327652 0.138939 -2.528436
H  -6.679766 0.752726 -0.536471
H  4.961291 0.961793 -2.20758
H  4.065356 2.27311 -1.49468
H  6.117213 1.89353 -0.164699
H  5.914785 0.443596 1.73779
H  4.395619 -0.338009 1.052764
elementType: S O N C H
totalener: -1373.46266061 hartree
nucrepener: 2150.50175451 hartree
electener: -3523.96441512 hartree
oneelecener: -6150.84807248 hartree
twoeener: 2626.88365736 hartree
cpcmener: -0.03775341 hartree
kineticenergy: 1368.48937093 hartree
xcener: -114.174946214326 hartree
chargesum: 0.0000000
charge: -0.040386 -0.518265 -0.437041 -0.083093 -0.027505 -0.257779 0.097835 0.002819 0.248713 0.225767 0.029977 -0.270179 -0.295383 -0.151904 0.314425 -0.234493 -0.116623 -0.257790 -0.172586 -0.165318 -0.010367 -0.217367 -0.245528 0.058074 0.095818 0.092183 0.103165 0.098622 0.096639 0.108185 0.141159 0.207000 0.200266 0.136392 0.102881 0.107519 0.101980 0.153633 0.155560 0.127631 0.113169 0.140645 0.128319 0.113233
qa: -0.0404 -0.5183 -0.4370 -0.0831 -0.0275 -0.2578 0.0978 0.0028 0.2487 0.2258 0.0300 -0.2702 -0.2954 -0.1519 0.3144 -0.2345 -0.1166 -0.2578 -0.1726 -0.1653 -0.0104 -0.2174 -0.2455 0.0581 0.0958 0.0922 0.1032 0.0986 0.0966 0.1082 0.1412 0.2070 0.2003 0.1364 0.1029 0.1075 0.1020 0.1536 0.1556 0.1276 0.1132 0.1406 0.1283 0.1132
va: 2.4464 2.0059 2.0655 2.8818 3.2158 3.3061 3.9061 3.1636 4.3079 4.1356 3.4101 3.9053 3.9532 3.8068 4.2325 3.9863 3.8691 3.9168 3.9160 3.9146 3.8874 3.8663 3.9128 1.0044 1.0204 1.0087 1.0030 1.0077 1.0057 1.0054 1.0114 0.9904 1.0259 1.0017 1.0043 0.9952 1.0009 0.9944 0.9911 1.0062 1.0234 0.9961 1.0063 1.0001
dispcorr: -0.023972373 hartree
energy: -1373.486632982586
dipole: 3.70400 -2.26784 1.43617 -5.27465 7.45091 2.17625 10.71343 -9.64580 1.06763
magnitude: 2.81753 au
magnitude: 7.16160 debye
