program: Orca
programVersion: 5.0.2
elementType: S O O N N N C C C C C C C C C C C C C C C C C H H H H H H H H H H H H H H H H H H H H H
charge: 0
multiplicity: 1
keywords: wb97x-d3
keywords: def2-TZVPP
keywords: def2/J RIJCOSX
keywords: DEFGRID2
keywords: scfconv7
keywords: smallprint printgap noloewdin
keywords: NOSOSCF
formula: C17H21N3O2S
InChI: InChI=1/C17H21N3O2S/c1-5-10-23-17(22)20-15(18)14(16(21)19(20)11(2)3)13-9-7-6-8-12(13)4/h5-9,11H,1,10,18H2,2-4H3
44 atoms
S  3.097325 0.09922 0.581854
O  -1.259635 -1.591669 1.87391
O  2.223676 0.910505 -1.77296
N  0.596441 -1.127767 0.573061
N  0.774961 -0.376893 -0.591616
N  -0.552331 0.983252 -2.023406
C  1.154053 -2.505548 0.468472
C  -1.395578 -0.155169 -0.038002
C  -0.76768 -1.005319 0.923103
C  -0.444543 0.193893 -0.961017
C  -2.822862 0.18813 -0.037835
C  0.272284 -3.435241 -0.351113
C  1.486229 -3.057229 1.843014
C  -3.269212 1.513575 0.07756
C  1.983592 0.281301 -0.772132
C  -3.759394 -0.844973 -0.124651
C  -4.642534 1.7584 0.068964
C  -2.317428 2.663925 0.223416
C  -5.119087 -0.584705 -0.121404
C  -5.562695 0.727568 -0.030703
C  4.561713 0.935928 -0.113157
C  4.525091 2.411104 0.092836
C  5.39288 3.06428 0.855273
H  2.098759 -2.385992 -0.063474
H  0.793915 -4.379799 -0.510779
H  -0.670481 -3.662066 0.147854
H  0.052009 -3.018845 -1.33559
H  2.060963 -3.9769 1.726068
H  0.60022 -3.29466 2.427654
H  2.097118 -2.355994 2.412011
H  -3.411313 -1.867194 -0.209578
H  0.172097 1.034235 -2.718993
H  -1.466799 1.319173 -2.279975
H  -4.99438 2.779727 0.15709
H  -1.425095 2.387817 0.785601
H  -1.98431 3.046404 -0.744254
H  -2.793815 3.495889 0.741898
H  -5.827557 -1.40007 -0.191803
H  -6.62278 0.947531 -0.029253
H  5.410903 0.486336 0.403412
H  4.640716 0.666876 -1.166988
H  3.740959 2.955867 -0.422001
H  5.336431 4.137989 0.978058
H  6.188324 2.553258 1.385315
elementType: S O N C H
totalener: -1373.46280076 hartree
nucrepener: 2130.64206260 hartree
electener: -3504.10486336 hartree
oneelecener: -6111.12257657 hartree
twoeener: 2607.01771321 hartree
cpcmener: -0.03681660 hartree
kineticenergy: 1368.49227550 hartree
xcener: -114.170803310157 hartree
chargesum: 0.0000000
charge: -0.038808 -0.512937 -0.443873 -0.083680 -0.047417 -0.254738 0.090313 -0.003309 0.235124 0.238644 0.061326 -0.289929 -0.266981 -0.146930 0.322026 -0.250851 -0.114046 -0.268527 -0.170116 -0.165346 -0.039222 -0.201620 -0.262908 0.066717 0.107500 0.093299 0.100168 0.101482 0.093843 0.091645 0.143046 0.198719 0.205481 0.137102 0.111635 0.102660 0.103480 0.154120 0.155600 0.129916 0.123141 0.147563 0.130700 0.115990
qa: -0.0388 -0.5129 -0.4439 -0.0837 -0.0474 -0.2547 0.0903 -0.0033 0.2351 0.2386 0.0613 -0.2899 -0.2670 -0.1469 0.3220 -0.2509 -0.1140 -0.2685 -0.1701 -0.1653 -0.0392 -0.2016 -0.2629 0.0667 0.1075 0.0933 0.1002 0.1015 0.0938 0.0916 0.1430 0.1987 0.2055 0.1371 0.1116 0.1027 0.1035 0.1541 0.1556 0.1299 0.1231 0.1476 0.1307 0.1160
va: 2.4324 2.0120 2.0569 2.8714 3.2233 3.3101 3.8664 3.1552 4.3372 4.1068 3.3588 3.9473 3.9052 3.8064 4.2494 4.0050 3.8631 3.9216 3.9153 3.9182 3.8299 3.8329 3.9657 1.0216 1.0043 1.0091 1.0037 1.0030 1.0207 1.0080 1.0085 1.0192 0.9940 1.0012 0.9957 0.9981 1.0041 0.9943 0.9911 1.0117 1.0266 1.0043 1.0023 1.0098
dispcorr: -0.023053006 hartree
energy: -1373.485853768619
dipole: 3.59439 -2.32747 1.26691 -1.12433 1.94449 0.82017 0.34859 -2.62172 -2.27313
magnitude: 2.72852 au
magnitude: 6.93536 debye
