program: Orca
programVersion: 5.0.2
elementType: S O O N N N C C C C C C C C C C C C C C C C C H H H H H H H H H H H H H H H H H H H H H
charge: 0
multiplicity: 1
keywords: wb97x-d3
keywords: def2-TZVPP
keywords: def2/J RIJCOSX
keywords: DEFGRID2
keywords: scfconv7
keywords: smallprint printgap noloewdin
keywords: NOSOSCF
formula: C17H21N3O2S
InChI: InChI=1/C17H21N3O2S/c1-5-10-23-17(22)20-15(18)14(16(21)19(20)11(2)3)13-9-7-6-8-12(13)4/h5-9,11H,1,10,18H2,2-4H3
44 atoms
S  2.915595 0.28358 -0.625056
O  -1.179773 -2.230857 -0.960087
O  1.958356 1.881534 1.243353
N  0.602289 -1.100328 -0.003726
N  0.681151 0.059985 0.771297
N  -0.803724 1.732578 1.583628
C  1.281027 -2.258772 0.625542
C  -1.484119 -0.136838 0.172921
C  -0.767115 -1.266037 -0.362893
C  -0.597639 0.616587 0.878307
C  -2.923599 0.108244 0.03339
C  1.654974 -3.289459 -0.426354
C  0.48378 -2.84606 1.783252
C  -3.402021 1.229002 -0.660801
C  1.795523 0.87382 0.601941
C  -3.82961 -0.793168 0.588582
C  -4.777817 1.429777 -0.736335
C  -2.465867 2.178357 -1.353825
C  -5.194553 -0.585773 0.493325
C  -5.670339 0.53745 -0.165319
C  4.240745 1.521783 -0.413777
C  5.448432 1.019689 -1.132302
C  5.948232 1.581878 -2.2238
H  2.213724 -1.855658 1.025045
H  2.287153 -4.05308 0.028138
H  0.78115 -3.776643 -0.850484
H  2.216677 -2.825677 -1.236445
H  -0.43497 -3.321032 1.440624
H  0.228001 -2.082737 2.519791
H  1.07802 -3.604782 2.293331
H  -3.449167 -1.665894 1.102921
H  -1.725699 2.129413 1.592322
H  -0.039359 2.241293 1.990365
H  -5.155733 2.293336 -1.270634
H  -1.940151 2.839342 -0.660946
H  -1.701733 1.639706 -1.914307
H  -3.006337 2.815765 -2.05258
H  -5.882922 -1.297281 0.929658
H  -6.735092 0.713368 -0.245854
H  3.909059 2.480781 -0.809184
H  4.437005 1.639808 0.652117
H  5.922651 0.137052 -0.716247
H  6.831565 1.188596 -2.707132
H  5.496653 2.456926 -2.674508
totalener: -1373.43581432 hartree
nucrepener: 2125.33810014 hartree
electener: -3498.77391447 hartree
oneelecener: -6099.86892600 hartree
twoeener: 2601.09501153 hartree
kineticenergy: 1368.55510712 hartree
xcener: -114.174703316918 hartree
chargesum: -0.0000000
charge: -0.011431 -0.378167 -0.402132 -0.079460 -0.060783 -0.262357 0.059855 -0.038804 0.211787 0.232404 0.091578 -0.242903 -0.277113 -0.205856 0.299339 -0.191092 -0.070331 -0.225130 -0.132826 -0.131520 -0.066883 -0.172466 -0.187281 0.050701 0.083083 0.109414 0.087232 0.099831 0.091398 0.092775 0.113547 0.174129 0.181810 0.105780 0.077680 0.109252 0.087635 0.122624 0.122925 0.101843 0.112750 0.124607 0.106012 0.086546
qa: -0.0114 -0.3782 -0.4021 -0.0795 -0.0608 -0.2624 0.0599 -0.0388 0.2118 0.2324 0.0916 -0.2429 -0.2771 -0.2059 0.2993 -0.1911 -0.0703 -0.2251 -0.1328 -0.1315 -0.0669 -0.1725 -0.1873 0.0507 0.0831 0.1094 0.0872 0.0998 0.0914 0.0928 0.1135 0.1741 0.1818 0.1058 0.0777 0.1093 0.0876 0.1226 0.1229 0.1018 0.1127 0.1246 0.1060 0.0865
va: 2.4585 2.1492 2.1006 2.8635 3.2073 3.2726 3.9514 3.1727 4.3382 4.0713 3.4018 3.8998 3.9431 3.8929 4.2638 4.0614 3.9007 3.9285 3.9630 3.9829 3.9304 3.8682 3.9739 1.0230 1.0042 1.0227 1.0107 1.0101 1.0052 1.0079 1.0164 1.0176 1.0436 1.0089 1.0061 0.9966 1.0099 1.0029 1.0007 1.0188 1.0144 1.0094 1.0095 1.0161
dispcorr: -0.022795479 hartree
energy: -1373.458609803321
dipole: 5.24064 -4.46881 0.77183 -2.41310 3.57465 1.16155 -0.73280 1.51920 0.78641
magnitude: 1.60105 au
magnitude: 4.06954 debye
