program: Orca
programVersion: 5.0.2
elementType: S O O N N N C C C C C C C C C C C C C C C C C H H H H H H H H H H H H H H H H H H H H H
charge: 0
multiplicity: 1
keywords: wb97x-d3
keywords: def2-TZVPP
keywords: def2/J RIJCOSX
keywords: DEFGRID2
keywords: scfconv7
keywords: smallprint printgap noloewdin
keywords: NOSOSCF
formula: C17H21N3O2S
InChI: InChI=1/C17H21N3O2S/c1-5-10-23-17(22)20-15(18)14(16(21)19(20)11(2)3)13-9-7-6-8-12(13)4/h5-9,11H,1,10,18H2,2-4H3
44 atoms
S  2.947321 0.489168 -0.639869
O  -1.128643 -1.980578 -1.220293
O  1.959941 1.962496 1.313579
N  0.638316 -0.935919 -0.149521
N  0.711443 0.154426 0.720658
N  -0.787855 1.736859 1.686579
C  1.328795 -2.142255 0.370319
C  -1.463762 -0.041842 0.157824
C  -0.731512 -1.083604 -0.514972
C  -0.573458 0.674086 0.900335
C  -2.913846 0.17233 0.12785
C  1.721186 -3.060771 -0.774548
C  0.533962 -2.850431 1.459731
C  -3.590266 0.461627 -1.065928
C  1.813917 0.993672 0.61035
C  -3.628863 0.113778 1.3245
C  -4.964076 0.676417 -1.014036
C  -2.864092 0.543651 -2.374749
C  -4.995025 0.33868 1.358496
C  -5.666397 0.618883 0.179652
C  4.270907 1.681983 -0.293279
C  5.532968 1.333472 -1.014802
C  5.806569 0.229716 -1.695461
H  2.253545 -1.767652 0.813231
H  2.365796 -3.853515 -0.393303
H  0.856398 -3.519978 -1.245956
H  2.275455 -2.511548 -1.53492
H  0.264769 -2.167099 2.266696
H  1.137433 -3.64735 1.895372
H  -0.377362 -3.301116 1.068068
H  -3.102427 -0.134435 2.238449
H  -1.678624 2.19533 1.601563
H  -0.007424 2.270885 2.029024
H  -5.493702 0.900709 -1.932229
H  -1.928363 1.096428 -2.281156
H  -2.611112 -0.44994 -2.745084
H  -3.472058 1.039221 -3.130738
H  -5.530872 0.284202 2.296934
H  -6.734515 0.792494 0.186701
H  3.938236 2.679819 -0.582951
H  4.453387 1.711356 0.782813
H  6.297078 2.100877 -0.938441
H  6.770781 0.099484 -2.165994
H  5.102038 -0.583316 -1.814495
totalener: -1373.43666686 hartree
nucrepener: 2132.89963588 hartree
electener: -3506.33630274 hartree
oneelecener: -6114.98106687 hartree
twoeener: 2608.64476413 hartree
kineticenergy: 1368.55202621 hartree
xcener: -114.177490952824 hartree
chargesum: 0.0000000
charge: -0.022613 -0.393969 -0.404161 -0.071105 -0.055278 -0.267836 0.060285 -0.004749 0.233550 0.208844 0.013831 -0.245117 -0.274548 -0.115504 0.308124 -0.255735 -0.069772 -0.253770 -0.115173 -0.138268 -0.037421 -0.172188 -0.198012 0.054969 0.085780 0.109317 0.082632 0.089193 0.092530 0.104116 0.134231 0.174359 0.180637 0.104349 0.089940 0.125645 0.080526 0.122985 0.122937 0.109840 0.106158 0.111478 0.104810 0.084153
qa: -0.0226 -0.3940 -0.4042 -0.0711 -0.0553 -0.2678 0.0603 -0.0047 0.2335 0.2088 0.0138 -0.2451 -0.2745 -0.1155 0.3081 -0.2557 -0.0698 -0.2538 -0.1152 -0.1383 -0.0374 -0.1722 -0.1980 0.0550 0.0858 0.1093 0.0826 0.0892 0.0925 0.1041 0.1342 0.1744 0.1806 0.1043 0.0899 0.1256 0.0805 0.1230 0.1229 0.1098 0.1062 0.1115 0.1048 0.0842
va: 2.4739 2.1271 2.1002 2.8432 3.2132 3.2507 3.9406 3.1803 4.2975 4.0921 3.4433 3.9021 3.9469 3.9238 4.2545 3.9811 3.9008 3.9300 3.9488 3.9866 3.9383 3.9031 3.9491 1.0210 1.0039 1.0232 1.0106 1.0062 1.0067 1.0089 1.0076 1.0150 1.0491 1.0092 0.9989 1.0025 1.0072 1.0028 1.0009 1.0094 1.0136 1.0029 1.0103 1.0199
dispcorr: -0.022674375 hartree
energy: -1373.459341232000
dipole: 4.66487 -3.81225 0.85262 -6.70435 7.75989 1.05554 -2.25296 3.01608 0.76312
magnitude: 1.55676 au
magnitude: 3.95696 debye
