program: Orca
programVersion: 5.0.2
elementType: S O O N N N C C C C C C C C C C C C C C C C C H H H H H H H H H H H H H H H H H H H H H
charge: 0
multiplicity: 1
keywords: wb97x-d3
keywords: def2-TZVPP
keywords: def2/J RIJCOSX
keywords: DEFGRID2
keywords: scfconv7
keywords: smallprint printgap noloewdin
keywords: NOSOSCF
formula: C17H21N3O2S
InChI: InChI=1/C17H21N3O2S/c1-5-10-23-17(22)20-15(18)14(16(21)19(20)11(2)3)13-9-7-6-8-12(13)4/h5-9,11H,1,10,18H2,2-4H3
44 atoms
S  2.860466 0.086954 -1.086566
O  -1.229314 -2.397289 -0.560789
O  2.014372 2.084283 0.422407
N  0.607767 -1.097437 -0.014473
N  0.734385 0.205694 0.47441
N  -0.701989 2.020261 1.034208
C  1.34275 -2.094077 0.803765
C  -1.471177 -0.110478 0.129802
C  -0.784101 -1.329672 -0.215586
C  -0.539359 0.776676 0.570965
C  -2.92279 0.099833 0.0784
C  1.655511 -3.329811 -0.022996
C  0.632937 -2.416135 2.112504
C  -3.488817 1.018371 -0.817306
C  1.821253 0.954845 0.043914
C  -3.750802 -0.632445 0.926246
C  -4.868957 1.201132 -0.802349
C  -2.641872 1.765801 -1.807707
C  -5.122693 -0.448058 0.920569
C  -5.682502 0.480903 0.05713
C  4.198786 1.317328 -1.240131
C  5.132381 1.301654 -0.078545
C  6.398223 0.913872 -0.151509
H  2.295321 -1.616626 1.041406
H  2.331184 -3.975474 0.539088
H  0.76041 -3.897065 -0.263966
H  2.149365 -3.054677 -0.954166
H  1.272123 -3.045164 2.732788
H  -0.298434 -2.956086 1.944523
H  0.414363 -1.511778 2.682494
H  -3.30332 -1.353198 1.597959
H  -1.622722 2.41998 1.011176
H  0.089081 2.611658 1.217219
H  -5.315129 1.908656 -1.491103
H  -1.94104 1.098281 -2.310028
H  -3.259952 2.237779 -2.570749
H  -2.046218 2.556343 -1.34473
H  -5.750981 -1.026001 1.585221
H  -6.753233 0.637529 0.043352
H  4.712232 1.04419 -2.163263
H  3.747609 2.298533 -1.385838
H  4.724996 1.641045 0.866755
H  7.041477 0.924348 0.717338
H  6.842255 0.57277 -1.078709
totalener: -1373.43654385 hartree
nucrepener: 2134.48597770 hartree
electener: -3507.92252155 hartree
oneelecener: -6118.14222891 hartree
twoeener: 2610.21970735 hartree
kineticenergy: 1368.55016487 hartree
xcener: -114.173973663043 hartree
chargesum: -0.0000000
charge: -0.014616 -0.375739 -0.414063 -0.080260 -0.061563 -0.261275 0.059752 -0.044893 0.214095 0.230007 0.086976 -0.241321 -0.277503 -0.202144 0.300880 -0.187981 -0.069346 -0.224305 -0.133848 -0.129859 -0.060362 -0.169146 -0.204793 0.054915 0.083145 0.109003 0.085963 0.093082 0.099368 0.091612 0.113819 0.173107 0.182542 0.106035 0.109993 0.087415 0.077108 0.121779 0.123022 0.110199 0.118854 0.131953 0.104373 0.084019
qa: -0.0146 -0.3757 -0.4141 -0.0803 -0.0616 -0.2613 0.0598 -0.0449 0.2141 0.2300 0.0870 -0.2413 -0.2775 -0.2021 0.3009 -0.1880 -0.0693 -0.2243 -0.1338 -0.1299 -0.0604 -0.1691 -0.2048 0.0549 0.0831 0.1090 0.0860 0.0931 0.0994 0.0916 0.1138 0.1731 0.1825 0.1060 0.1100 0.0874 0.0771 0.1218 0.1230 0.1102 0.1189 0.1320 0.1044 0.0840
va: 2.4407 2.1521 2.0824 2.8627 3.2149 3.2716 3.9511 3.1804 4.3399 4.0774 3.4048 3.9006 3.9435 3.8974 4.2473 4.0559 3.8994 3.9303 3.9645 3.9811 3.8694 3.8509 3.9794 1.0207 1.0048 1.0221 1.0114 1.0079 1.0101 1.0047 1.0158 1.0186 1.0438 1.0091 0.9961 1.0100 1.0051 1.0032 1.0007 1.0161 1.0256 1.0081 1.0097 1.0158
dispcorr: -0.023235431 hartree
energy: -1373.459779285137
dipole: 5.75437 -5.00839 0.74599 -2.61268 3.90452 1.29184 2.75675 -2.28043 0.47632
magnitude: 1.56596 au
magnitude: 3.98035 debye
