program: Orca
programVersion: 5.0.2
elementType: S O O N N N C C C C C C C C C C C C C C C C C H H H H H H H H H H H H H H H H H H H H H
charge: 0
multiplicity: 1
keywords: wb97x-d3
keywords: def2-TZVPP
keywords: def2/J RIJCOSX
keywords: DEFGRID2
keywords: scfconv7
keywords: smallprint printgap noloewdin
keywords: NOSOSCF
formula: C17H21N3O2S
InChI: InChI=1/C17H21N3O2S/c1-5-10-23-17(22)20-15(18)14(16(21)19(20)11(2)3)13-9-7-6-8-12(13)4/h5-9,11H,1,10,18H2,2-4H3
44 atoms
S  3.093599 -0.386486 -0.665159
O  -1.276138 -2.38245 -0.750512
O  2.326419 1.58705 0.916662
N  0.628416 -1.365747 0.090515
N  0.848847 -0.129515 0.702774
N  -0.42374 1.787962 1.303924
C  1.154341 -2.504185 0.884177
C  -1.32911 -0.144067 0.113723
C  -0.750188 -1.408568 -0.2684
C  -0.356022 0.582775 0.727723
C  -2.738701 0.222681 -0.057369
C  1.402724 -3.705484 -0.012085
C  0.284907 -2.832074 2.091033
C  -3.124316 1.334084 -0.820073
C  2.047777 0.520847 0.429454
C  -3.719527 -0.571165 0.537904
C  -4.480706 1.636795 -0.921453
C  -2.123778 2.177907 -1.557929
C  -5.062148 -0.264006 0.416362
C  -5.444389 0.853871 -0.310568
C  4.507647 0.764548 -0.712316
C  4.282411 1.885255 -1.66915
C  4.207515 3.16151 -1.319413
H  2.127072 -2.167496 1.24872
H  2.020929 -3.427917 -0.865071
H  1.932984 -4.471602 0.554676
H  0.477288 -4.135136 -0.385798
H  0.11959 -1.952753 2.715551
H  0.780413 -3.582143 2.708516
H  -0.682525 -3.235917 1.793641
H  -3.414254 -1.441313 1.103567
H  -1.273189 2.313193 1.20151
H  0.414941 2.268709 1.579308
H  -4.785272 2.493861 -1.510476
H  -1.271632 1.588938 -1.894798
H  -2.579842 2.63678 -2.434324
H  -1.728987 2.995414 -0.949337
H  -5.806827 -0.894029 0.884288
H  -6.491381 1.107171 -0.414016
H  4.723556 1.117563 0.295315
H  5.343406 0.138254 -1.032313
H  4.176769 1.604516 -2.711663
H  4.053514 3.937065 -2.056898
H  4.292039 3.476725 -0.288109
totalener: -1373.43572058 hartree
nucrepener: 2146.46647200 hartree
electener: -3519.90219258 hartree
oneelecener: -6142.22570016 hartree
twoeener: 2622.32350758 hartree
kineticenergy: 1368.55322070 hartree
xcener: -114.174510218094 hartree
chargesum: -0.0000000
charge: -0.026468 -0.377345 -0.405651 -0.078107 -0.066628 -0.260141 0.057655 -0.041116 0.205749 0.229088 0.118596 -0.241559 -0.276554 -0.197198 0.311564 -0.198999 -0.079795 -0.246035 -0.130101 -0.134049 -0.068845 -0.172951 -0.184720 0.053749 0.085967 0.083622 0.108278 0.092667 0.093616 0.098721 0.113212 0.172989 0.182045 0.105651 0.112631 0.093588 0.080207 0.122617 0.122662 0.108704 0.122581 0.115957 0.103802 0.090348
qa: -0.0265 -0.3773 -0.4057 -0.0781 -0.0666 -0.2601 0.0577 -0.0411 0.2057 0.2291 0.1186 -0.2416 -0.2766 -0.1972 0.3116 -0.1990 -0.0798 -0.2460 -0.1301 -0.1340 -0.0688 -0.1730 -0.1847 0.0537 0.0860 0.0836 0.1083 0.0927 0.0936 0.0987 0.1132 0.1730 0.1820 0.1057 0.1126 0.0936 0.0802 0.1226 0.1227 0.1087 0.1226 0.1160 0.1038 0.0903
va: 2.4361 2.1494 2.0980 2.8601 3.2000 3.2734 3.9497 3.2052 4.3386 4.0735 3.3980 3.9010 3.9422 3.8551 4.2504 4.0712 3.9124 3.9237 3.9643 3.9857 3.8620 3.8532 3.9738 1.0218 1.0106 1.0042 1.0227 1.0051 1.0077 1.0099 1.0168 1.0204 1.0451 1.0081 0.9992 1.0080 1.0009 1.0027 1.0007 1.0334 1.0070 1.0117 1.0072 1.0193
dispcorr: -0.023447817 hartree
energy: -1373.459168395437
dipole: 2.31931 -1.47173 0.84758 0.35377 0.83665 1.19042 0.74378 -0.13319 0.61059
magnitude: 1.58377 au
magnitude: 4.02563 debye
