program: Orca
programVersion: 5.0.2
elementType: S O O N N N C C C C C C C C C C C C C C C C C H H H H H H H H H H H H H H H H H H H H H
charge: 0
multiplicity: 1
keywords: wb97x-d3
keywords: def2-TZVPP
keywords: def2/J RIJCOSX
keywords: DEFGRID2
keywords: scfconv7
keywords: smallprint printgap noloewdin
keywords: NOSOSCF
formula: C17H21N3O2S
InChI: InChI=1/C17H21N3O2S/c1-5-10-23-17(22)20-15(18)14(16(21)19(20)11(2)3)13-9-7-6-8-12(13)4/h5-9,11H,1,10,18H2,2-4H3
44 atoms
S  3.153835 -0.153731 0.841783
O  -1.23687 -1.914765 1.576832
O  2.38907 1.365686 -1.18149
N  0.645081 -1.210639 0.425043
N  0.869311 -0.172961 -0.48012
N  -0.374814 1.610471 -1.46098
C  1.116563 -2.52504 -0.076416
C  -1.307329 -0.030943 0.086185
C  -0.725472 -1.130385 0.815912
C  -0.321666 0.532357 -0.664722
C  -2.707332 0.395064 0.157387
C  0.190502 -3.109774 -1.135742
C  1.373796 -3.473383 1.082398
C  -3.534722 0.368948 -0.975653
C  2.096144 0.476954 -0.422398
C  -3.228906 0.819625 1.378854
C  -4.847391 0.816862 -0.852277
C  -3.046279 -0.163964 -2.29197
C  -4.540067 1.249011 1.485692
C  -5.35021 1.258282 0.360458
C  4.610242 0.900733 0.536901
C  4.466993 2.248316 1.157488
C  4.425244 3.383417 0.474527
H  2.081301 -2.318234 -0.543866
H  0.026779 -2.407698 -1.955131
H  0.636157 -4.009007 -1.561847
H  -0.776765 -3.386947 -0.717106
H  2.016686 -3.005274 1.8268
H  1.880525 -4.36439 0.710326
H  0.45303 -3.781643 1.570727
H  -2.589658 0.811825 2.252022
H  -1.153984 2.231493 -1.325468
H  0.481753 2.004591 -1.812699
H  -5.49229 0.800532 -1.722869
H  -2.404583 0.545521 -2.818605
H  -2.462872 -1.075362 -2.155982
H  -3.881776 -0.396554 -2.951067
H  -4.927844 1.573673 2.442147
H  -6.376597 1.594449 0.428514
H  5.432126 0.345485 0.993765
H  4.801189 0.956293 -0.534003
H  4.394639 2.267069 2.239779
H  4.331055 4.336799 0.975918
H  4.478294 3.402156 -0.606045
totalener: -1373.43701010 hartree
nucrepener: 2143.89043954 hartree
electener: -3517.32744964 hartree
oneelecener: -6137.04016561 hartree
twoeener: 2619.71271597 hartree
kineticenergy: 1368.56158910 hartree
xcener: -114.175612776604 hartree
chargesum: -0.0000000
charge: -0.025859 -0.375471 -0.405181 -0.069442 -0.060070 -0.279941 0.057983 -0.032394 0.219269 0.247189 0.024489 -0.287573 -0.241217 -0.173143 0.311868 -0.171121 -0.076542 -0.230690 -0.138213 -0.128416 -0.068590 -0.172355 -0.185005 0.054276 0.086478 0.095856 0.104645 0.086184 0.083809 0.108597 0.116371 0.176863 0.177032 0.104261 0.092149 0.099643 0.087650 0.121882 0.122911 0.122535 0.108790 0.116066 0.104214 0.090212
qa: -0.0259 -0.3755 -0.4052 -0.0694 -0.0601 -0.2799 0.0580 -0.0324 0.2193 0.2472 0.0245 -0.2876 -0.2412 -0.1731 0.3119 -0.1711 -0.0765 -0.2307 -0.1382 -0.1284 -0.0686 -0.1724 -0.1850 0.0543 0.0865 0.0959 0.1046 0.0862 0.0838 0.1086 0.1164 0.1769 0.1770 0.1043 0.0921 0.0996 0.0876 0.1219 0.1229 0.1225 0.1088 0.1161 0.1042 0.0902
va: 2.4358 2.1525 2.0977 2.8528 3.2181 3.2387 3.9399 3.1917 4.3199 4.0356 3.4592 3.9482 3.9042 3.8760 4.2443 4.0357 3.9095 3.9196 3.9694 3.9751 3.8618 3.8506 3.9746 1.0217 1.0057 1.0103 1.0064 1.0109 1.0042 1.0220 1.0174 1.0091 1.0541 1.0095 1.0062 0.9977 1.0100 1.0033 1.0006 1.0070 1.0329 1.0117 1.0072 1.0193
dispcorr: -0.023606121 hartree
energy: -1373.460616224972
dipole: 0.79805 0.10393 0.90198 -4.21954 5.11172 0.89219 -6.16683 5.22332 -0.94351
magnitude: 1.58107 au
magnitude: 4.01875 debye
