program: Orca
programVersion: 5.0.2
elementType: O N C C C C C C C C C C C C C C C C C C C C H H H H H H H H H H H H H H H H H H H H H H H H H H H H H H H H H
charge: 0
multiplicity: 1
keywords: wb97x-d3
keywords: def2-TZVPP
keywords: def2/J RIJCOSX
keywords: DEFGRID2
keywords: scfconv7
keywords: smallprint printgap noloewdin
keywords: NOSOSCF
formula: C20H33NO
InChI: InChI=1/C20H33NO/c1-15(12-21-13-16(2)22-17(3)14-21)11-18-7-9-19(10-8-18)20(4,5)6/h7-10,15-17H,11-14H2,1-6H3
55 atoms
O  0.812202 3.577088 -0.764142
N  2.246205 1.151684 -0.364122
C  2.612786 -0.006552 0.439196
C  2.672412 -1.316491 -0.364573
C  0.813764 1.163018 -0.610136
C  2.617919 2.387562 0.301602
C  0.383972 2.385105 -1.402654
C  2.211083 3.59119 -0.530579
C  1.980873 -2.474168 0.371997
C  4.112985 -1.684784 -0.700535
C  -1.122389 2.442072 -1.539928
C  2.564994 4.894798 0.150878
C  0.493615 -2.285212 0.467281
C  -3.787802 -1.450441 0.566627
C  -2.296848 -1.765244 0.567118
C  -0.140118 -1.971814 1.661861
C  -0.29922 -2.359232 -0.678777
C  -1.508637 -1.719426 1.712404
C  -1.657659 -2.102249 -0.630455
C  -4.315005 -1.141755 1.966516
C  -4.570529 -2.646538 0.012152
C  -4.033846 -0.225502 -0.324027
H  1.9266 -0.1067 1.295731
H  3.597273 0.18405 0.874957
H  2.139811 -1.168876 -1.309292
H  0.247104 1.130422 0.338066
H  0.528928 0.273931 -1.175387
H  3.700855 2.406605 0.443658
H  2.159821 2.472172 1.303029
H  0.837926 2.32905 -2.403193
H  2.73904 3.536243 -1.494552
H  2.197256 -3.404653 -0.160735
H  2.411498 -2.58124 1.371903
H  4.624925 -0.867349 -1.210761
H  4.160198 -2.560272 -1.350247
H  4.679815 -1.912786 0.20527
H  -1.604025 2.513529 -0.562905
H  -1.436687 3.29655 -2.139913
H  -1.4904 1.539996 -2.029323
H  2.283388 5.751283 -0.462531
H  2.069722 4.98836 1.118811
H  3.640827 4.949167 0.31724
H  0.440272 -1.915507 2.575704
H  0.158056 -2.609217 -1.629857
H  -1.947185 -1.476859 2.671147
H  -2.22832 -2.160708 -1.549768
H  -3.82466 -0.273188 2.409873
H  -4.188632 -1.984525 2.648652
H  -5.382527 -0.920857 1.916354
H  -4.415934 -3.538485 0.622143
H  -4.282071 -2.888556 -1.011537
H  -5.640797 -2.429546 0.006801
H  -3.715374 -0.39863 -1.353165
H  -3.494954 0.648199 0.048474
H  -5.096976 0.02356 -0.346933
elementType: O N C H
totalener: -912.08113152 hartree
nucrepener: 1932.56809444 hartree
electener: -2844.64922596 hartree
oneelecener: -5075.58586371 hartree
twoeener: 2230.93663776 hartree
cpcmener: -0.02078848 hartree
kineticenergy: 907.59018863 hartree
xcener: -93.058819175452 hartree
chargesum: -0.0000000
charge: -0.408174 -0.190489 -0.150699 0.067622 -0.104897 -0.119747 0.161995 0.181172 -0.140596 -0.311323 -0.304849 -0.286546 0.084224 0.366126 -0.116250 -0.223267 -0.288130 -0.155518 -0.186051 -0.359823 -0.330586 -0.353662 0.101610 0.095428 0.048426 0.067634 0.099686 0.093506 0.073475 0.059995 0.051218 0.098091 0.096163 0.093184 0.090454 0.086122 0.084232 0.102824 0.088283 0.096488 0.085715 0.088100 0.139635 0.142002 0.146379 0.142142 0.098684 0.101990 0.100549 0.100868 0.096572 0.097375 0.100970 0.098647 0.103019
qa: -0.4082 -0.1905 -0.1507 0.0676 -0.1049 -0.1197 0.1620 0.1812 -0.1406 -0.3113 -0.3048 -0.2865 0.0842 0.3661 -0.1162 -0.2233 -0.2881 -0.1555 -0.1861 -0.3598 -0.3306 -0.3537 0.1016 0.0954 0.0484 0.0676 0.0997 0.0935 0.0735 0.0600 0.0512 0.0981 0.0962 0.0932 0.0905 0.0861 0.0842 0.1028 0.0883 0.0965 0.0857 0.0881 0.1396 0.1420 0.1464 0.1421 0.0987 0.1020 0.1005 0.1009 0.0966 0.0974 0.1010 0.0986 0.1030
va: 1.9598 2.8850 3.8950 3.6883 3.8721 3.8976 3.9117 3.8526 3.8529 3.9368 3.9496 3.9441 3.5118 3.5843 3.7262 3.9680 3.9670 3.8873 3.9409 3.9295 3.9153 3.9327 1.0105 1.0022 1.0322 1.0226 1.0084 1.0100 1.0175 1.0158 1.0209 1.0044 1.0082 1.0084 1.0052 1.0008 1.0112 1.0105 1.0028 1.0077 1.0102 1.0057 1.0070 1.0040 0.9975 1.0032 1.0008 1.0010 1.0070 1.0038 1.0043 1.0033 1.0011 1.0014 1.0064
dispcorr: -0.028884625 hartree
energy: -912.110016142368
dipole: -4.01992 4.26585 0.24593 2.65375 -3.19875 -0.54499 -0.02393 0.12342 0.09950
magnitude: 0.60613 au
magnitude: 1.54067 debye
