program: Orca
programVersion: 5.0.2
elementType: O N C C C C C C C C C C C C C C C C C C C C H H H H H H H H H H H H H H H H H H H H H H H H H H H H H H H H H
charge: 0
multiplicity: 1
keywords: wb97x-d3
keywords: def2-TZVPP
keywords: def2/J RIJCOSX
keywords: DEFGRID2
keywords: scfconv7
keywords: smallprint printgap noloewdin
keywords: NOSOSCF
formula: C20H33NO
InChI: InChI=1/C20H33NO/c1-15(12-21-13-16(2)22-17(3)14-21)11-18-7-9-19(10-8-18)20(4,5)6/h7-10,15-17H,11-14H2,1-6H3
55 atoms
O  0.126088 2.978216 0.026834
N  1.804973 0.728176 0.326123
C  3.03372 -0.014601 0.515176
C  3.147464 -1.285977 -0.327744
C  1.485498 1.580475 1.450236
C  1.78015 1.48558 -0.905361
C  0.136404 2.251267 1.244334
C  0.431449 2.16308 -1.092565
C  2.197985 -2.397816 0.143177
C  4.584503 -1.792914 -0.279179
C  -0.201789 3.20621 2.367493
C  0.402145 3.034975 -2.328538
C  0.734588 -2.073213 0.047525
C  -3.459956 -0.904878 -0.211555
C  -2.000821 -1.340579 -0.149124
C  -0.05178 -1.909467 1.184246
C  0.11871 -1.907787 -1.187228
C  -1.386091 -1.547311 1.088073
C  -1.218487 -1.542566 -1.284505
C  -3.952109 -0.735483 -1.648111
C  -3.614571 0.438448 0.512124
C  -4.337948 -1.956271 0.476452
H  3.098136 -0.303752 1.569588
H  3.914306 0.623851 0.323526
H  2.911994 -1.05128 -1.371532
H  2.254761 2.356812 1.621458
H  1.436773 0.972094 2.357129
H  1.951058 0.820869 -1.755313
H  2.579212 2.2508 -0.929863
H  -0.631617 1.462571 1.1999
H  -0.334049 1.376422 -1.185188
H  2.404659 -3.291718 -0.453779
H  2.448279 -2.656585 1.176961
H  4.704957 -2.704601 -0.866242
H  4.889205 -2.019715 0.745645
H  5.282045 -1.052136 -0.673407
H  0.542927 3.999632 2.457183
H  -1.177612 3.668685 2.212442
H  -0.23889 2.670682 3.316159
H  -0.573049 3.50673 -2.456626
H  1.159441 3.81996 -2.280608
H  0.596466 2.434479 -3.217318
H  0.392679 -2.041135 2.164388
H  0.693971 -2.044877 -2.096391
H  -1.95305 -1.413443 2.002069
H  -1.641722 -1.410822 -2.271451
H  -3.885977 -1.66434 -2.217609
H  -3.391572 0.030675 -2.187502
H  -4.999683 -0.429797 -1.644177
H  -3.327443 0.3716 1.562712
H  -4.653105 0.775012 0.477223
H  -2.998062 1.211304 0.046969
H  -4.246465 -2.92846 -0.011898
H  -5.38905 -1.662009 0.436035
H  -4.074965 -2.085746 1.527411
elementType: O N C H
totalener: -912.07707879 hartree
nucrepener: 2002.77939672 hartree
electener: -2914.85647551 hartree
oneelecener: -5216.47358683 hartree
twoeener: 2301.61711132 hartree
cpcmener: -0.02055601 hartree
kineticenergy: 907.58449147 hartree
xcener: -93.061680430148 hartree
chargesum: -0.0000000
charge: -0.411987 -0.162975 -0.191751 0.109034 -0.141050 -0.139890 0.228188 0.209355 -0.124497 -0.314841 -0.293639 -0.293279 0.136570 0.391809 -0.087393 -0.273874 -0.260462 -0.220640 -0.198442 -0.360200 -0.360405 -0.331310 0.097091 0.086660 0.042155 0.081989 0.097231 0.106051 0.079168 0.008822 0.026438 0.101125 0.087713 0.091964 0.088800 0.091333 0.089744 0.096545 0.090458 0.096682 0.088793 0.089929 0.134752 0.137010 0.137719 0.142478 0.100797 0.100008 0.100259 0.101718 0.106777 0.096195 0.100808 0.097634 0.096831
qa: -0.4120 -0.1630 -0.1918 0.1090 -0.1410 -0.1399 0.2282 0.2094 -0.1245 -0.3148 -0.2936 -0.2933 0.1366 0.3918 -0.0874 -0.2739 -0.2605 -0.2206 -0.1984 -0.3602 -0.3604 -0.3313 0.0971 0.0867 0.0422 0.0820 0.0972 0.1061 0.0792 0.0088 0.0264 0.1011 0.0877 0.0920 0.0888 0.0913 0.0897 0.0965 0.0905 0.0967 0.0888 0.0899 0.1348 0.1370 0.1377 0.1425 0.1008 0.1000 0.1003 0.1017 0.1068 0.0962 0.1008 0.0976 0.0968
va: 1.9473 2.8173 3.9591 3.7219 3.8944 3.8723 3.8650 3.8675 3.7866 3.9476 3.9504 3.9527 3.5182 3.5477 3.6301 3.9874 3.9688 3.9529 3.8474 3.9291 3.9304 3.9164 1.0006 1.0108 1.0276 1.0212 1.0053 1.0022 1.0287 1.0273 1.0236 1.0032 1.0114 1.0042 1.0004 1.0057 1.0107 1.0073 1.0049 1.0074 1.0106 1.0050 1.0063 1.0057 1.0061 1.0012 1.0012 0.9996 1.0070 1.0006 1.0081 1.0001 1.0035 1.0035 1.0037
dispcorr: -0.031549185 hartree
energy: -912.108627977544
dipole: -1.99711 2.52479 0.52768 3.57855 -4.05710 -0.47855 -0.38838 0.45446 0.06608
magnitude: 0.71542 au
magnitude: 1.81846 debye
