program: Orca
programVersion: 5.0.2
elementType: O N C C C C C C C C C C C C C C C C C C C C H H H H H H H H H H H H H H H H H H H H H H H H H H H H H H H H H
charge: 0
multiplicity: 1
keywords: wb97x-d3
keywords: def2-TZVPP
keywords: def2/J RIJCOSX
keywords: DEFGRID2
keywords: scfconv7
keywords: smallprint printgap noloewdin
keywords: NOSOSCF
formula: C20H33NO
InChI: InChI=1/C20H33NO/c1-15(12-21-13-16(2)22-17(3)14-21)11-18-7-9-19(10-8-18)20(4,5)6/h7-10,15-17H,11-14H2,1-6H3
55 atoms
O  0.016574 2.875558 -0.195195
N  1.788502 0.724305 0.231127
C  3.023306 0.008427 0.467728
C  3.149916 -1.310595 -0.298601
C  1.419218 1.608849 1.311388
C  1.754362 1.420387 -1.033847
C  0.046037 2.210948 1.05914
C  0.379615 2.024608 -1.27114
C  2.235035 -2.414975 0.255607
C  4.598615 -1.782758 -0.253475
C  -0.345529 3.202976 2.131594
C  0.323613 2.833124 -2.548258
C  0.767746 -2.104613 0.194366
C  -3.384876 -0.803215 -0.077765
C  -1.952849 -1.311041 0.04904
C  0.02542 -1.863291 1.341356
C  0.107692 -2.01116 -1.030428
C  -1.307174 -1.469876 1.271362
C  -1.217533 -1.618389 -1.100783
C  -3.385826 0.48963 -0.903927
C  -4.013875 -0.498753 1.280486
C  -4.24428 -1.857151 -0.785602
H  3.089445 -0.214043 1.537919
H  3.899011 0.640887 0.238152
H  2.886091 -1.143198 -1.348726
H  2.15183 2.423809 1.461626
H  1.381012 1.03788 2.242776
H  1.965244 0.722519 -1.84733
H  2.520025 2.217481 -1.088614
H  -0.686673 1.389513 1.047842
H  -0.343665 1.197762 -1.337632
H  2.436742 -3.331289 -0.30802
H  2.52297 -2.621305 1.291282
H  4.727087 -2.72511 -0.78795
H  4.930753 -1.940353 0.775645
H  5.269365 -1.051498 -0.707229
H  -1.341193 3.609485 1.950426
H  -0.364398 2.710933 3.104328
H  0.359715 4.033813 2.189009
H  -0.674126 3.241874 -2.712703
H  1.034935 3.660596 -2.531611
H  0.564167 2.200187 -3.402554
H  0.500114 -1.948983 2.31242
H  0.646913 -2.221611 -1.947596
H  -1.828898 -1.269293 2.19769
H  -1.680644 -1.534703 -2.077062
H  -2.998282 0.332429 -1.911639
H  -2.778638 1.264222 -0.429795
H  -4.40209 0.878301 -1.001491
H  -5.033422 -0.135182 1.1405
H  -3.465248 0.274166 1.822572
H  -4.069384 -1.382951 1.918161
H  -3.868604 -2.087146 -1.783552
H  -5.271048 -1.501569 -0.89697
H  -4.274962 -2.788839 -0.217409
elementType: O N C H
totalener: -912.07619704 hartree
nucrepener: 2016.96055324 hartree
electener: -2929.03675028 hartree
oneelecener: -5244.79525672 hartree
twoeener: 2315.75850644 hartree
cpcmener: -0.02029768 hartree
kineticenergy: 907.59146927 hartree
xcener: -93.064432948716 hartree
chargesum: 0.0000000
charge: -0.415907 -0.163012 -0.190236 0.109298 -0.137936 -0.143535 0.234756 0.227615 -0.127085 -0.314982 -0.299143 -0.294254 0.128662 0.394823 -0.100788 -0.230482 -0.293842 -0.189867 -0.211905 -0.359747 -0.363375 -0.331081 0.096785 0.086891 0.041143 0.082518 0.097173 0.106275 0.076449 0.003746 0.011539 0.100811 0.087369 0.091928 0.088984 0.091232 0.097833 0.090688 0.090165 0.097052 0.090423 0.090852 0.133645 0.137839 0.140630 0.138777 0.102180 0.093291 0.107620 0.101539 0.100422 0.100751 0.097124 0.097816 0.100534
qa: -0.4159 -0.1630 -0.1902 0.1093 -0.1379 -0.1435 0.2348 0.2276 -0.1271 -0.3150 -0.2991 -0.2943 0.1287 0.3948 -0.1008 -0.2305 -0.2938 -0.1899 -0.2119 -0.3597 -0.3634 -0.3311 0.0968 0.0869 0.0411 0.0825 0.0972 0.1063 0.0764 0.0037 0.0115 0.1008 0.0874 0.0919 0.0890 0.0912 0.0978 0.0907 0.0902 0.0971 0.0904 0.0909 0.1336 0.1378 0.1406 0.1388 0.1022 0.0933 0.1076 0.1015 0.1004 0.1008 0.0971 0.0978 0.1005
va: 1.9367 2.8107 3.9571 3.7205 3.9020 3.8929 3.8424 3.8526 3.7956 3.9470 3.9530 3.9516 3.5229 3.5438 3.6193 3.9688 3.9798 3.8516 3.9330 3.9283 3.9314 3.9133 1.0007 1.0096 1.0285 1.0210 1.0045 1.0010 1.0284 1.0333 1.0269 1.0034 1.0116 1.0041 1.0005 1.0056 1.0060 1.0046 1.0113 1.0067 1.0109 1.0047 1.0068 1.0042 1.0019 1.0054 1.0002 1.0018 1.0086 1.0069 0.9975 1.0011 1.0033 1.0034 1.0038
dispcorr: -0.032514521 hartree
energy: -912.108711562963
dipole: -1.93003 2.49104 0.56102 4.03766 -4.48800 -0.45034 -1.00981 1.03250 0.02269
magnitude: 0.71976 au
magnitude: 1.82949 debye
