program: Orca
programVersion: 5.0.2
elementType: O N C C C C C C C C C C C C C C C C C C C C H H H H H H H H H H H H H H H H H H H H H H H H H H H H H H H H H
charge: 0
multiplicity: 1
keywords: wb97x-d3
keywords: def2-TZVPP
keywords: def2/J RIJCOSX
keywords: DEFGRID2
keywords: scfconv7
keywords: smallprint printgap noloewdin
keywords: NOSOSCF
formula: C20H33NO
InChI: InChI=1/C20H33NO/c1-15(12-21-13-16(2)22-17(3)14-21)11-18-7-9-19(10-8-18)20(4,5)6/h7-10,15-17H,11-14H2,1-6H3
55 atoms
O  1.389383 3.945684 -0.710265
N  2.224699 1.300323 -0.173091
C  2.260956 0.035404 0.541889
C  2.41129 -1.157707 -0.407035
C  0.89157 1.585453 -0.66909
C  2.69928 2.417116 0.61892
C  0.87339 2.872697 -1.476398
C  2.691032 3.689653 -0.214246
C  1.82074 -2.440759 0.195793
C  3.871105 -1.352738 -0.794261
C  -0.528244 3.242276 -1.910533
C  3.133182 4.897747 0.58194
C  0.323856 -2.377319 0.32061
C  -4.008319 -1.89043 0.554148
C  -2.49731 -2.090437 0.503501
C  -0.311599 -2.248369 1.54804
C  -0.48182 -2.38667 -0.819067
C  -1.693246 -2.107238 1.638705
C  -1.855727 -2.247178 -0.7290
C  -4.524436 -1.737711 1.984073
C  -4.711387 -3.093807 -0.084767
C  -4.367922 -0.61971 -0.226382
H  1.367386 -0.077073 1.176029
H  3.114375 0.043961 1.227076
H  1.849948 -0.942797 -1.322755
H  0.162135 1.663366 0.158388
H  0.552442 0.767816 -1.310063
H  3.722588 2.214991 0.945602
H  2.092528 2.575717 1.528895
H  1.50305 2.72537 -2.367744
H  3.380259 3.541846 -1.060405
H  2.099825 -3.285573 -0.441185
H  2.272063 -2.630472 1.17468
H  4.303003 -0.425985 -1.175545
H  3.982625 -2.111455 -1.571365
H  4.469673 -1.667945 0.064208
H  -0.530895 4.155042 -2.507802
H  -0.956911 2.447475 -2.521877
H  -1.183655 3.394587 -1.050923
H  2.482279 5.071733 1.44072
H  4.148639 4.754872 0.95279
H  3.131945 5.797379 -0.035062
H  0.278836 -2.247418 2.45747
H  -0.026134 -2.498763 -1.797033
H  -2.129962 -2.000226 2.622661
H  -2.435638 -2.253139 -1.644507
H  -4.090721 -0.872674 2.489772
H  -4.321518 -2.620816 2.59315
H  -5.606568 -1.59537 1.972026
H  -4.427249 -3.231286 -1.129174
H  -5.795475 -2.960959 -0.058368
H  -4.478775 -4.018682 0.447007
H  -3.87286 0.258096 0.194195
H  -5.445207 -0.440894 -0.194116
H  -4.080952 -0.688965 -1.276834
elementType: O N C H
totalener: -912.09468665 hartree
nucrepener: 1889.90076543 hartree
electener: -2801.99545207 hartree
oneelecener: -4990.13354962 hartree
twoeener: 2188.13809755 hartree
cpcmener: -0.01723559 hartree
kineticenergy: 907.57031294 hartree
xcener: -93.053773187954 hartree
chargesum: -0.0000000
charge: -0.384741 -0.194394 -0.154871 0.060849 -0.099470 -0.107131 0.158626 0.167605 -0.123281 -0.304967 -0.286258 -0.284175 0.079497 0.331803 -0.116923 -0.222215 -0.300710 -0.145643 -0.158190 -0.357637 -0.325368 -0.328826 0.103157 0.097111 0.044921 0.069272 0.092548 0.090192 0.070891 0.052673 0.050096 0.099030 0.091530 0.083982 0.091535 0.081784 0.095531 0.086647 0.084411 0.084125 0.086125 0.094880 0.138042 0.138605 0.144017 0.138400 0.100482 0.100446 0.099452 0.095507 0.096053 0.101057 0.101835 0.096088 0.095997
qa: -0.3847 -0.1944 -0.1549 0.0608 -0.0995 -0.1071 0.1586 0.1676 -0.1233 -0.3050 -0.2863 -0.2842 0.0795 0.3318 -0.1169 -0.2222 -0.3007 -0.1456 -0.1582 -0.3576 -0.3254 -0.3288 0.1032 0.0971 0.0449 0.0693 0.0925 0.0902 0.0709 0.0527 0.0501 0.0990 0.0915 0.0840 0.0915 0.0818 0.0955 0.0866 0.0844 0.0841 0.0861 0.0949 0.1380 0.1386 0.1440 0.1384 0.1005 0.1004 0.0995 0.0955 0.0961 0.1011 0.1018 0.0961 0.0960
va: 1.9810 2.8764 3.9008 3.7307 3.8775 3.8807 3.9166 3.8840 3.8368 3.9218 3.9481 3.9455 3.5370 3.6324 3.7493 3.9743 4.0059 3.8893 3.9573 3.9276 3.9156 3.9180 1.0065 1.0041 1.0321 1.0243 1.0054 1.0092 1.0172 1.0170 1.0200 1.0044 1.0093 1.0227 1.0043 1.0032 1.0084 1.0054 1.0111 1.0109 1.0058 1.0083 1.0064 1.0051 0.9979 1.0026 1.0008 1.0009 1.0072 1.0048 1.0036 1.0040 1.0044 1.0040 1.0043
dispcorr: -0.026766831 hartree
energy: -912.121453477264
dipole: -4.24130 4.31486 0.07355 2.73043 -3.28098 -0.55054 -0.03914 0.16042 0.12128
magnitude: 0.56852 au
magnitude: 1.44506 debye
