program: Orca
programVersion: 5.0.2
elementType: O N C C C C C C C C C C C C C C C C C C C C H H H H H H H H H H H H H H H H H H H H H H H H H H H H H H H H H
charge: 0
multiplicity: 1
keywords: wb97x-d3
keywords: def2-TZVPP
keywords: def2/J RIJCOSX
keywords: DEFGRID2
keywords: scfconv7
keywords: smallprint printgap noloewdin
keywords: NOSOSCF
formula: C20H33NO
InChI: InChI=1/C20H33NO/c1-15(12-21-13-16(2)22-17(3)14-21)11-18-7-9-19(10-8-18)20(4,5)6/h7-10,15-17H,11-14H2,1-6H3
55 atoms
O  3.469378 4.54343 -0.105172
N  2.566894 1.873692 -0.288952
C  2.384831 0.491335 0.105331
C  0.961981 -0.032231 -0.103581
C  1.960114 2.809659 0.636388
C  3.961142 2.213848 -0.489351
C  2.106634 4.234563 0.125456
C  4.086692 3.639134 -1.003301
C  0.892435 -1.489989 0.378234
C  0.531186 0.108425 -1.556314
C  1.555133 5.248281 1.103834
C  5.529022 4.060151 -1.177939
C  -0.499579 -2.053773 0.346933
C  -4.626655 -3.470566 0.20439
C  -3.17612 -2.999697 0.236652
C  -0.930708 -2.886542 -0.677481
C  -1.428366 -1.714643 1.330508
C  -2.241702 -3.348807 -0.733517
C  -2.732327 -2.176704 1.276337
C  -5.552237 -2.248093 0.173669
C  -4.924989 -4.300454 1.458834
C  -4.930295 -4.328987 -1.022341
H  2.683278 0.330651 1.156478
H  3.061854 -0.120115 -0.500617
H  0.271244 0.547218 0.519844
H  2.40603 2.733474 1.645573
H  0.895497 2.590549 0.741626
H  4.392223 1.533785 -1.228581
H  4.555778 2.106212 0.436155
H  1.551634 4.31014 -0.822859
H  3.576219 3.690586 -1.977845
H  1.554337 -2.10368 -0.240862
H  1.282988 -1.542163 1.399155
H  0.567696 1.148371 -1.879049
H  -0.488515 -0.245621 -1.713578
H  1.185782 -0.465853 -2.217807
H  1.642653 6.262768 0.712769
H  0.497566 5.057327 1.288803
H  2.076965 5.205324 2.061635
H  5.597517 5.080414 -1.557787
H  6.079605 4.007665 -0.236958
H  6.027238 3.408254 -1.896294
H  -0.235821 -3.177165 -1.457448
H  -1.127095 -1.075353 2.153298
H  -2.520613 -3.989777 -1.559211
H  -3.416413 -1.883798 2.064141
H  -6.598699 -2.560919 0.147022
H  -5.367494 -1.633615 -0.709769
H  -5.425024 -1.613146 1.05171
H  -4.284852 -5.183408 1.512482
H  -5.96243 -4.643073 1.453009
H  -4.776708 -3.727498 2.375621
H  -4.763002 -3.787683 -1.955644
H  -5.978618 -4.633075 -1.008873
H  -4.330423 -5.240737 -1.049417
elementType: O N C H
totalener: -912.09590332 hartree
nucrepener: 1806.17991174 hartree
electener: -2718.27581506 hartree
oneelecener: -4822.55695105 hartree
twoeener: 2104.28113599 hartree
cpcmener: -0.01721523 hartree
kineticenergy: 907.56780929 hartree
xcener: -93.054655911555 hartree
chargesum: -0.0000000
charge: -0.384706 -0.189716 -0.178200 0.123429 -0.102788 -0.110711 0.154068 0.166319 -0.106627 -0.340076 -0.283614 -0.284001 0.016201 0.330308 -0.115781 -0.214004 -0.243207 -0.149342 -0.184179 -0.328464 -0.325396 -0.359261 0.088288 0.094511 0.051443 0.073432 0.099584 0.091634 0.068710 0.055104 0.051242 0.092234 0.097893 0.090220 0.100404 0.083928 0.095183 0.086137 0.084243 0.094813 0.083939 0.086049 0.134438 0.138486 0.143304 0.138864 0.095385 0.101511 0.096037 0.100980 0.095776 0.095656 0.101193 0.099405 0.099725
qa: -0.3847 -0.1897 -0.1782 0.1234 -0.1028 -0.1107 0.1541 0.1663 -0.1066 -0.3401 -0.2836 -0.2840 0.0162 0.3303 -0.1158 -0.2140 -0.2432 -0.1493 -0.1842 -0.3285 -0.3254 -0.3593 0.0883 0.0945 0.0514 0.0734 0.0996 0.0916 0.0687 0.0551 0.0512 0.0922 0.0979 0.0902 0.1004 0.0839 0.0952 0.0861 0.0842 0.0948 0.0839 0.0860 0.1344 0.1385 0.1433 0.1389 0.0954 0.1015 0.0960 0.1010 0.0958 0.0957 0.1012 0.0994 0.0997
va: 1.9800 2.8668 3.9604 3.6709 3.8369 3.8891 3.9265 3.8814 3.8147 3.9415 3.9475 3.9466 3.5825 3.6345 3.7481 3.9810 4.0106 3.8969 3.9897 3.9178 3.9167 3.9276 1.0129 1.0005 1.0250 1.0253 1.0082 1.0094 1.0178 1.0147 1.0187 1.0114 1.0100 1.0300 1.0007 1.0031 1.0082 1.0054 1.0111 1.0083 1.0108 1.0058 1.0087 1.0046 0.9979 1.0027 1.0038 1.0038 1.0046 1.0041 1.0036 1.0046 1.0011 1.0071 1.0009
dispcorr: -0.025433411 hartree
energy: -912.121336732405
dipole: -5.08295 4.82896 -0.25399 0.40984 -0.96313 -0.55329 -1.24975 1.28823 0.03848
magnitude: 0.61001 au
magnitude: 1.55053 debye
