program: Orca
programVersion: 5.0.2
elementType: O N C C C C C C C C C C C C C C C C C C C C H H H H H H H H H H H H H H H H H H H H H H H H H H H H H H H H H
charge: 0
multiplicity: 1
keywords: wb97x-d3
keywords: def2-TZVPP
keywords: def2/J RIJCOSX
keywords: DEFGRID2
keywords: scfconv7
keywords: smallprint printgap noloewdin
keywords: NOSOSCF
formula: C20H33NO
InChI: InChI=1/C20H33NO/c1-15(12-21-13-16(2)22-17(3)14-21)11-18-7-9-19(10-8-18)20(4,5)6/h7-10,15-17H,11-14H2,1-6H3
55 atoms
O  1.767115 4.076763 -0.566143
N  1.784305 1.308051 -0.006117
C  2.104688 0.112041 0.747811
C  2.559253 -1.074542 -0.098806
C  0.991393 2.233101 0.778301
C  2.958221 1.975902 -0.531216
C  0.609254 3.449606 -0.047344
C  2.562253 3.199896 -1.343115
C  1.554206 -1.435906 -1.208398
C  2.865718 -2.252492 0.818443
C  -0.151133 4.470292 0.770162
C  3.769523 3.972615 -1.827549
C  0.156203 -1.708139 -0.726816
C  -3.889991 -2.39106 0.774007
C  -2.472588 -2.183297 0.250548
C  -0.232626 -2.962708 -0.270984
C  -0.804616 -0.696925 -0.702228
C  -1.517564 -3.195199 0.209485
C  -2.083223 -0.928314 -0.224313
C  -4.131881 -3.826041 1.238801
C  -4.894393 -2.070104 -0.339992
C  -4.133666 -1.452378 1.962263
H  1.207515 -0.18394 1.300063
H  2.874543 0.316703 1.512785
H  3.493878 -0.813681 -0.607156
H  1.522663 2.565578 1.689028
H  0.078786 1.72841 1.106184
H  3.511119 1.294979 -1.182051
H  3.648504 2.281317 0.277065
H  -0.024859 3.110099 -0.881895
H  1.980331 2.855893 -2.212581
H  1.530737 -0.623282 -1.936873
H  1.937513 -2.31244 -1.738431
H  1.990958 -2.562759 1.393654
H  3.648935 -1.994631 1.534332
H  3.215184 -3.117991 0.252765
H  -0.435147 5.331437 0.163811
H  -1.067052 4.030085 1.165772
H  0.441875 4.82784 1.614063
H  4.394933 3.34166 -2.459895
H  3.471551 4.839169 -2.419278
H  4.380317 4.323083 -0.993381
H  0.473861 -3.784802 -0.294208
H  -0.542741 0.291002 -1.060868
H  -1.75957 -4.192525 0.552235
H  -2.789251 -0.106017 -0.226076
H  -5.155907 -3.928228 1.602994
H  -3.468499 -4.113785 2.056736
H  -4.003032 -4.549234 0.431065
H  -4.811963 -1.038069 -0.684012
H  -5.918113 -2.213616 0.013401
H  -4.748332 -2.720183 -1.205071
H  -3.441471 -1.659441 2.780992
H  -5.148561 -1.576662 2.346888
H  -4.016281 -0.403126 1.686908
elementType: O N C H
totalener: -912.09384299 hartree
nucrepener: 1902.44469008 hartree
electener: -2814.53853307 hartree
oneelecener: -5015.16505559 hartree
twoeener: 2200.62652253 hartree
cpcmener: -0.01559626 hartree
kineticenergy: 907.57573221 hartree
xcener: -93.058909106559 hartree
chargesum: 0.0000000
charge: -0.384444 -0.193174 -0.173893 0.135541 -0.132084 -0.125777 0.165754 0.158946 -0.133394 -0.351981 -0.286292 -0.283830 0.049087 0.325700 -0.115581 -0.236381 -0.266733 -0.142556 -0.166117 -0.356759 -0.326529 -0.326543 0.099797 0.095122 0.048006 0.087068 0.097189 0.099932 0.072020 0.059018 0.055619 0.091979 0.102152 0.089904 0.097543 0.098076 0.095079 0.086582 0.084694 0.085852 0.094917 0.084486 0.144318 0.132951 0.142502 0.137438 0.098539 0.100411 0.099897 0.095935 0.095345 0.101456 0.101289 0.095681 0.096242
qa: -0.3844 -0.1932 -0.1739 0.1355 -0.1321 -0.1258 0.1658 0.1589 -0.1334 -0.3520 -0.2863 -0.2838 0.0491 0.3257 -0.1156 -0.2364 -0.2667 -0.1426 -0.1661 -0.3568 -0.3265 -0.3265 0.0998 0.0951 0.0480 0.0871 0.0972 0.0999 0.0720 0.0590 0.0556 0.0920 0.1022 0.0899 0.0975 0.0981 0.0951 0.0866 0.0847 0.0859 0.0949 0.0845 0.1443 0.1330 0.1425 0.1374 0.0985 0.1004 0.0999 0.0959 0.0953 0.1015 0.1013 0.0957 0.0962
va: 1.9799 2.7990 3.9079 3.7210 3.8425 3.8809 3.9060 3.9152 3.8419 3.9639 3.9485 3.9484 3.5190 3.6349 3.7467 3.9916 3.9878 3.8962 3.9886 3.9275 3.9170 3.9177 0.9937 1.0152 1.0185 1.0216 1.0079 1.0048 1.0237 1.0118 1.0150 1.0182 1.0051 0.9969 1.0080 1.0025 1.0082 1.0049 1.0114 1.0055 1.0086 1.0110 0.9991 1.0345 0.9985 1.0032 1.0075 1.0011 1.0011 1.0047 1.0039 1.0037 1.0040 1.0039 1.0043
dispcorr: -0.027884777 hartree
energy: -912.121727763266
dipole: -3.22161 3.31207 0.09046 -0.80052 0.25464 -0.54588 5.30410 -5.10920 0.19489
magnitude: 0.58664 au
magnitude: 1.49112 debye
