program: Orca
programVersion: 5.0.2
elementType: O N C C C C C C C C C C C C C C C C C C C C H H H H H H H H H H H H H H H H H H H H H H H H H H H H H H H H H
charge: 0
multiplicity: 1
keywords: wb97x-d3
keywords: def2-TZVPP
keywords: def2/J RIJCOSX
keywords: DEFGRID2
keywords: scfconv7
keywords: smallprint printgap noloewdin
keywords: NOSOSCF
formula: C20H33NO
InChI: InChI=1/C20H33NO/c1-15(12-21-13-16(2)22-17(3)14-21)11-18-7-9-19(10-8-18)20(4,5)6/h7-10,15-17H,11-14H2,1-6H3
55 atoms
O  2.663487 4.4651 -0.29266
N  2.463877 1.722005 0.354774
C  2.858714 0.327483 0.393391
C  1.732589 -0.655116 0.066746
C  3.431904 2.583261 1.004709
C  2.209602 2.198267 -0.990615
C  2.933484 4.019609 1.024215
C  1.730455 3.640701 -0.96605
C  0.556738 -0.474921 1.035743
C  2.277982 -2.076734 0.094513
C  3.940075 4.965651 1.640918
C  1.538333 4.195842 -2.360461
C  -0.675083 -1.239672 0.6435
C  -4.280384 -3.432095 -0.486219
C  -3.020891 -2.654284 -0.117427
C  -1.025917 -2.441659 1.254228
C  -1.512859 -0.767996 -0.361462
C  -2.170916 -3.130525 0.883351
C  -2.660426 -1.45748 -0.732844
C  -5.18733 -3.538463 0.745763
C  -3.893047 -4.839509 -0.955906
C  -5.071688 -2.756731 -1.605353
H  3.218151 0.110551 1.405053
H  3.709838 0.133371 -0.282753
H  1.371626 -0.46018 -0.949241
H  4.419648 2.548197 0.509526
H  3.577503 2.245319 2.033985
H  1.434759 1.589968 -1.461111
H  3.110417 2.121065 -1.627522
H  2.004265 4.047265 1.614766
H  0.76848 3.667587 -0.430343
H  0.877956 -0.776684 2.038232
H  0.313407 0.587834 1.095058
H  3.110411 -2.195801 -0.601974
H  1.517692 -2.807325 -0.184873
H  2.640777 -2.342151 1.090932
H  4.880252 4.968196 1.086168
H  3.557217 5.986826 1.667614
H  4.156327 4.669638 2.667952
H  2.470578 4.181072 -2.928284
H  0.80353 3.60223 -2.905359
H  1.17368 5.223537 -2.330296
H  -0.400598 -2.840959 2.045207
H  -1.279164 0.168887 -0.856104
H  -2.403833 -4.056066 1.397114
H  -3.27736 -1.034722 -1.5145
H  -6.102691 -4.082747 0.501602
H  -5.477285 -2.551516 1.112149
H  -4.704072 -4.068377 1.568201
H  -3.369281 -5.402501 -0.181797
H  -3.244584 -4.800422 -1.833582
H  -4.783754 -5.410917 -1.227367
H  -5.413212 -1.757728 -1.326712
H  -5.960028 -3.347328 -1.83727
H  -4.49255 -2.669619 -2.526834
elementType: O N C H
totalener: -912.09608169 hartree
nucrepener: 1830.03631603 hartree
electener: -2742.13239773 hartree
oneelecener: -4870.28342673 hartree
twoeener: 2128.15102900 hartree
cpcmener: -0.01691436 hartree
kineticenergy: 907.56533759 hartree
xcener: -93.054076682544 hartree
chargesum: -0.0000000
charge: -0.384247 -0.188410 -0.161923 0.101757 -0.117770 -0.102898 0.167853 0.154262 -0.104908 -0.339932 -0.284160 -0.283266 0.015431 0.326143 -0.116089 -0.246154 -0.213769 -0.167127 -0.165630 -0.325151 -0.326078 -0.359109 0.096121 0.088286 0.051409 0.068162 0.092420 0.097034 0.077245 0.051705 0.055474 0.093404 0.094430 0.096075 0.097801 0.087082 0.084053 0.094890 0.085751 0.084559 0.085761 0.094809 0.136906 0.140783 0.138510 0.144463 0.095474 0.101470 0.094877 0.095388 0.101131 0.095787 0.100057 0.099049 0.100807
qa: -0.3842 -0.1884 -0.1619 0.1018 -0.1178 -0.1029 0.1679 0.1543 -0.1049 -0.3399 -0.2842 -0.2833 0.0154 0.3261 -0.1161 -0.2462 -0.2138 -0.1671 -0.1656 -0.3252 -0.3261 -0.3591 0.0961 0.0883 0.0514 0.0682 0.0924 0.0970 0.0772 0.0517 0.0555 0.0934 0.0944 0.0961 0.0978 0.0871 0.0841 0.0949 0.0858 0.0846 0.0858 0.0948 0.1369 0.1408 0.1385 0.1445 0.0955 0.1015 0.0949 0.0954 0.1011 0.0958 0.1001 0.0990 0.1008
va: 1.9813 2.8541 3.9226 3.7040 3.8907 3.8344 3.8830 3.9312 3.7188 3.9689 3.9464 3.9470 3.5690 3.6367 3.7488 3.9964 4.0026 3.9807 3.9113 3.9173 3.9166 3.9275 0.9990 1.0132 1.0217 1.0179 1.0098 1.0058 1.0262 1.0183 1.0140 1.0121 1.0484 1.0057 0.9994 1.0030 1.0112 1.0082 1.0059 1.0109 1.0053 1.0085 1.0069 1.0033 1.0022 0.9982 1.0038 1.0037 1.0049 1.0048 1.0037 1.0037 1.0009 1.0072 1.0007
dispcorr: -0.025798266 hartree
energy: -912.121879956882
dipole: -1.60623 1.62499 0.01875 -4.41171 3.77194 -0.63977 -2.93987 3.01991 0.08004
magnitude: 0.64503 au
magnitude: 1.63954 debye
