program: Gaussian 09
title: 000063374
version: EM64L-G09RevD.01
frameworkgroup: C1[X(C18H18N2O)]
method: RPBEPBE
basis: SDD
operation: Freq
keyword: #p
keyword: freq=noraman
keyword: PBEPBE/SDD
title: #p freq=noraman PBEPBE/SDD
converged: NO YES NO NO
title: Mulliken charges:
elementType: O N N C C C C C C C C C C C C C C C C C C H H H H H H H H H H H H H H H H H H
charge: -0.277561 -0.234874 -0.050225 -0.047139 -0.600790 -0.711747 0.164668 0.180980 0.512788 0.148914 0.027619 -0.808930 -0.435914 -0.388772 -0.332576 -0.346210 -0.246455 -0.228886 -0.234310 -0.208193 -0.240939 0.241631 0.205980 0.276448 0.219085 0.276213 0.213723 0.230364 0.262594 0.277190 0.230169 0.247857 0.271956 0.259555 0.232392 0.225144 0.227423 0.232290 0.228537
chargesum: 0.00000
title: Mulliken charges with hydrogens summed into heavy atoms:
elementType: O N N C C C C C C C C C C C C C C C C C C
charge: -0.277561 -0.234874 -0.050225 0.194492 -0.118362 -0.002726 0.164668 0.180980 0.512788 0.148914 0.027619 -0.038782 -0.205745 -0.140915 -0.060620 -0.086656 -0.014063 -0.003741 -0.006887 0.024097 -0.012403
polarizability: 2.49311795e+02 3.28107767e+01 1.94918249e+02 3.44283955e+01 -1.20253089e+01 1.72842919e+02
1716.lowfreq: -12.2915 -6.4436 -0.0006 -0.0006 0.0004 1.4082 18.5304 31.3791 45.9110
frequency: 18.2660 31.3757 45.8299 58.9738 94.3636 107.8705 160.6795 164.0195 188.2383 203.9831 220.0764 263.6348 279.8029 289.0368 304.5313 354.2542 360.0097 390.6134 404.4350 416.2707 447.9877 461.3055 481.6769 506.7320 532.3522 542.3108 586.5108 592.7833 618.0737 632.7847 642.2434 662.8129 693.7753 708.1772 755.4037 783.5659 797.4532 809.9562 841.2973 852.7006 858.4844 892.7703 895.2837 907.8496 929.8387 978.6290 979.6081 990.0447 990.6355 997.2581 1001.7224 1013.5356 1026.6209 1029.9632 1032.5994 1048.7601 1074.8321 1094.8291 1111.8344 1114.9846 1147.4118 1163.4102 1172.3658 1188.5664 1203.4701 1216.9238 1226.0073 1247.1953 1283.5955 1287.8038 1311.7125 1321.1234 1330.3251 1375.1346 1380.3791 1382.1289 1394.6541 1400.7898 1440.3890 1449.8462 1457.8094 1459.9094 1463.6498 1479.0223 1481.7491 1484.7188 1492.5059 1555.2833 1562.2502 1591.9821 1599.6017 1614.0814 1618.4919 2986.3674 2990.7124 3001.9548 3067.8568 3070.8036 3079.4331 3092.0645 3106.6127 3122.0870 3122.7484 3130.6621 3132.6227 3133.3356 3144.1779 3148.2968 3162.3885 3163.6252 3173.1613
redmass: 4.9402 5.0316 4.2192 4.6131 3.6955 3.6266 4.5780 4.0877 2.2177 1.5167 2.9549 1.2610 4.2878 3.9067 2.8181 2.9386 3.3098 4.2559 2.8616 3.5207 5.9904 3.4803 3.3548 3.0616 3.7297 8.1818 4.4841 4.2296 6.2506 4.0213 5.5395 5.4921 4.1732 1.8529 1.8928 1.4807 3.6852 3.3292 3.5056 4.7874 1.2541 1.9046 1.5315 1.6255 1.5075 1.3734 1.3849 6.0587 3.4580 1.3160 1.3292 2.2116 2.2417 1.7789 2.2162 1.5491 1.7700 2.5029 1.7904 1.9751 2.4645 1.1760 1.0556 1.1211 1.7526 2.4940 2.2124 2.9351 2.2404 1.3236 3.1045 1.4286 1.2822 1.3523 1.5981 2.7833 2.7277 1.7340 2.1237 2.1501 2.3547 1.1765 1.2268 1.1388 1.1538 1.8509 1.0822 5.7553 7.1003 6.0214 8.8216 6.1082 6.8235 1.0392 1.0377 1.0647 1.0979 1.0862 1.0992 1.0951 1.0879 1.0874 1.0971 1.0967 1.0911 1.0861 1.0958 1.0900 1.1014 1.0955 1.0997
irintensity: 0.0055 0.6174 0.0324 2.0192 1.6711 3.8572 0.7910 0.4032 0.4500 0.7286 0.5729 1.0068 0.7236 4.4450 1.7909 1.0089 4.2801 2.4317 0.0528 1.3196 0.0901 3.0582 1.9952 8.7127 4.8533 2.5339 9.6680 5.7443 0.5531 3.7974 12.0945 4.4007 28.9195 50.7032 41.0188 78.2310 0.1910 3.0816 5.0134 5.1857 0.0457 3.2934 1.0285 0.5191 2.1176 2.6851 0.0124 0.1446 4.4530 0.2531 0.0106 9.4424 6.3339 18.7662 0.8844 4.2810 16.9496 2.8517 5.5472 32.2513 43.4082 4.1191 0.4810 1.5584 35.7943 0.9683 8.5009 19.9806 13.6544 3.6032 77.8147 4.7289 0.7680 22.9555 23.1051 14.0499 7.3465 29.2331 10.2559 2.8677 19.7898 31.4712 39.0698 17.3140 22.7958 6.6756 23.6148 177.6839 26.1426 7.3841 293.0899 8.5428 8.3097 17.6853 25.7750 41.3439 8.0286 5.4281 35.7386 5.7386 11.0592 1.4148 9.9269 5.2963 10.6780 4.7109 37.9785 8.2631 21.7014 12.2270 23.4706
temp: 298.150 k
press: 1.00000 atm
elementType: 8 7 7 6 6 6 6 6 6 6 6 6 6 6 6 6 6 6 6 6 6 1 1 1 1 1 1 1 1 1 1 1 1 1 1 1 1 1 1
symmnumber: 1
zpe: 830743.4 jmol-1
zpe.correction: 0.316413 hartree
zpe.thermalcorrener: 0.334465 hartree
zpe.thermalcorrenthalpy: 0.335410 hartree
zpe.thermalcorrgfe: 0.269279 hartree
zpe.sumelectzpe: -879.988485 hartree
zpe.sumelectthermal: -879.970433 hartree
zpe.sumelectthermalent: -879.969489 hartree
zpe.sumelectthermalfe: -880.035619 hartree
dipole: 1.1604 0.0009 1.6928
dipole: 2.0523
quadrupole: -110.6289 -117.6972 -126.2547
quadrupole: 7.2963 8.4842 6.0220
quadrupole: 7.5647 0.4964 -8.0611 7.2963 8.4842 6.0220
hfenergy: -880.3048983 hartree
pointgroup: C01 [X(C18H18N2O1)]
dipole: -0.442834 -0.0053409 0.6751493 debye
polarizability: 243.3983007|34.899508|200.1146851|-37.8089928|8.0756374|173.5599771 unknown
InChI: InChI=1S/C18H18N2O/c1-13(12-15-8-4-3-5-9-15)20-14(2)19-17-11-7-6-10-16(17)18(20)21/h3-11,13H,12H2,1-2H3
charge 0 multiplicity 1
39 atoms
O  0.863224 -1.682581 -1.655703
N  0.117763 -1.053283 0.4919
N  1.299225 0.602848 1.800076
C  -1.029979 -2.026414 0.384456
C  -2.004806 -1.667659 -0.782994
C  -0.522165 -3.483535 0.301871
C  0.287395 -0.241964 1.640223
C  1.03423 -0.980708 -0.609135
C  -2.61109 -0.279835 -0.647222
C  2.158236 -0.046947 -0.427183
C  2.255351 0.713764 0.778781
C  -0.726053 -0.31207 2.762499
C  -3.772697 -0.066876 0.141193
C  -2.009523 0.83967 -1.278826
C  3.139872 0.094226 -1.443881
C  3.346205 1.61173 0.95041
C  4.211353 0.982966 -1.262261
C  -4.316613 1.227943 0.300382
C  -2.549607 2.136365 -1.122671
C  4.312134 1.742179 -0.060069
C  -3.703421 2.336018 -0.329833
H  -1.598605 -1.918658 1.320634
H  -2.80213 -2.435655 -0.758589
H  -1.462581 -1.776505 -1.735947
H  0.152236 -3.712185 1.146786
H  0.017624 -3.661175 -0.640608
H  -1.383554 -4.174325 0.35483
H  -0.785779 -1.317599 3.218761
H  -1.7375 -0.025528 2.42128
H  -0.398094 0.400892 3.532067
H  -4.262992 -0.924239 0.62137
H  -1.121031 0.688918 -1.903791
H  3.033193 -0.504751 -2.354111
H  3.400393 2.184811 1.880831
H  4.971828 1.094035 -2.042503
H  -5.218399 1.372171 0.906595
H  -2.07221 2.988604 -1.61945
H  5.151198 2.433776 0.075101
H  -4.123729 3.340876 -0.210069
