program: Orca
programVersion: 5.0.2
elementType: O N C C C C C C C C C C C C C C C C C C C C H H H H H H H H H H H H H H H H H H H H H H H H H H H H H H H H H
charge: 0
multiplicity: 1
keywords: wb97x-d3
keywords: def2-TZVPP
keywords: def2/J RIJCOSX
keywords: DEFGRID2
keywords: scfconv7
keywords: smallprint printgap noloewdin
keywords: NOSOSCF
formula: C20H33NO
InChI: InChI=1/C20H33NO/c1-15(12-21-13-16(2)22-17(3)14-21)11-18-7-9-19(10-8-18)20(4,5)6/h7-10,15-17H,11-14H2,1-6H3
55 atoms
O  1.9386 4.229592 -0.697501
N  2.23094 1.47314 -0.191268
C  1.94631 0.178451 0.397014
C  2.145766 -0.972282 -0.589125
C  1.123156 1.978726 -0.974432
C  2.649873 2.463549 0.776434
C  1.497679 3.28969 -1.650026
C  3.021449 3.760438 0.071623
C  1.632323 -2.294569 -0.002637
C  3.609397 -1.087754 -0.99262
C  0.326134 3.898073 -2.392656
C  3.406818 4.852684 1.046598
C  0.142425 -2.328471 0.194648
C  -4.183708 -2.314562 0.751029
C  -2.675284 -2.324016 0.529375
C  -0.434479 -2.296157 1.459982
C  -0.716002 -2.368215 -0.896869
C  -1.809623 -2.294583 1.622125
C  -2.093747 -2.365036 -0.734246
C  -4.5870 -3.559446 1.552202
C  -4.961735 -2.320143 -0.564816
C  -4.575449 -1.052913 1.531565
H  0.930172 0.146727 0.821787
H  2.633589 0.024014 1.236232
H  1.558839 -0.766259 -1.491695
H  0.22179 2.132752 -0.352409
H  0.855234 1.250648 -1.743493
H  3.524932 2.087237 1.313226
H  1.869101 2.67393 1.530613
H  2.312242 3.076444 -2.361353
H  3.876434 3.544154 -0.589859
H  1.927125 -3.108093 -0.672281
H  2.139215 -2.490332 0.948124
H  3.98102 -0.135792 -1.36906
H  3.750948 -1.840496 -1.769828
H  4.22945 -1.375655 -0.139672
H  -0.032016 3.218143 -3.166137
H  -0.502121 4.106502 -1.714257
H  0.612935 4.832448 -2.873936
H  3.667363 5.769764 0.519095
H  2.588011 5.077323 1.731281
H  4.271163 4.549961 1.638181
H  0.203201 -2.270879 2.336235
H  -0.304605 -2.405637 -1.899631
H  -2.210581 -2.268225 2.628262
H  -2.71301 -2.397022 -1.62015
H  -4.101245 -3.593336 2.527726
H  -4.319204 -4.472756 1.019273
H  -5.665582 -3.573417 1.722719
H  -6.033445 -2.305415 -0.360924
H  -4.758345 -3.213028 -1.15847
H  -4.736369 -1.445782 -1.1779
H  -4.291446 -0.150822 0.987947
H  -4.097897 -1.011281 2.510731
H  -5.654956 -1.022251 1.693537
totalener: -912.07510705 hartree
nucrepener: 1859.04766541 hartree
electener: -2771.12277246 hartree
oneelecener: -4927.81481114 hartree
twoeener: 2156.69203868 hartree
kineticenergy: 907.61144235 hartree
xcener: -93.059708415264 hartree
chargesum: 0.0000000
charge: -0.322905 -0.164004 -0.170911 0.085747 -0.106047 -0.095757 0.149947 0.150458 -0.155605 -0.280009 -0.262368 -0.264196 0.078950 0.256338 -0.065685 -0.218947 -0.194062 -0.126897 -0.131740 -0.289011 -0.336909 -0.291045 0.102504 0.080184 0.027256 0.068081 0.081665 0.072115 0.065953 0.043938 0.043238 0.097161 0.081704 0.090748 0.083336 0.071032 0.070954 0.080596 0.092957 0.092686 0.079827 0.071652 0.106015 0.109117 0.104737 0.116477 0.086042 0.098562 0.086135 0.090190 0.093415 0.095792 0.098773 0.086129 0.085686
qa: -0.3229 -0.1640 -0.1709 0.0857 -0.1060 -0.0958 0.1499 0.1505 -0.1556 -0.2800 -0.2624 -0.2642 0.0789 0.2563 -0.0657 -0.2189 -0.1941 -0.1269 -0.1317 -0.2890 -0.3369 -0.2910 0.1025 0.0802 0.0273 0.0681 0.0817 0.0721 0.0660 0.0439 0.0432 0.0972 0.0817 0.0907 0.0833 0.0710 0.0710 0.0806 0.0930 0.0927 0.0798 0.0717 0.1060 0.1091 0.1047 0.1165 0.0860 0.0986 0.0861 0.0902 0.0934 0.0958 0.0988 0.0861 0.0857
va: 2.0419 2.8960 3.9551 3.7478 3.8949 3.8906 3.9292 3.9303 3.8487 3.9160 3.9464 3.9452 3.6080 3.7583 3.7638 4.0498 4.0584 4.0359 3.9608 3.9226 3.9319 3.9227 1.0100 1.0055 1.0304 1.0251 1.0088 1.0119 1.0173 1.0148 1.0167 1.0070 1.0145 1.0326 1.0069 1.0062 1.0073 1.0137 1.0110 1.0112 1.0137 1.0070 1.0138 1.0111 1.0108 1.0062 1.0082 1.0067 1.0065 1.0118 1.0027 1.0026 1.0066 1.0082 1.0069
dispcorr: -0.025960851 hartree
energy: -912.101067901871
dipole: -4.31888 4.23801 -0.08087 2.03927 -2.40848 -0.36920 0.59741 -0.51402 0.08339
magnitude: 0.38705 au
magnitude: 0.98380 debye
