program: Orca
programVersion: 5.0.2
elementType: N C C C C C C C C C C C C C C C C C C C H H H H H H H H H H H H H H H H H H H H H H H H H H H H H H H
charge: 0
multiplicity: 1
keywords: wb97x-d3
keywords: def2-TZVPP
keywords: def2/J RIJCOSX
keywords: DEFGRID2
keywords: scfconv7
keywords: smallprint printgap noloewdin
keywords: NOSOSCF
formula: C19H31N
InChI: InChI=1/C19H31N/c1-16(15-20-12-6-5-7-13-20)14-17-8-10-18(11-9-17)19(2,3)4/h8-11,16H,5-7,12-15H2,1-4H3
51 atoms
N  2.468551 -1.956889 -0.274115
C  1.751273 -0.828497 0.296812
C  2.2402 0.543628 -0.163117
C  3.798306 -2.083953 0.305037
C  1.71552 -3.18524 -0.065298
C  4.57768 -3.236448 -0.308505
C  2.400884 -4.384839 -0.69889
C  3.816328 -4.546456 -0.161949
C  1.560929 1.659982 0.653282
C  2.060602 0.736558 -1.662961
C  0.064532 1.726718 0.524569
C  -4.273796 1.839761 0.047145
C  -2.763322 1.796298 0.245826
C  -0.545156 2.440277 -0.507339
C  -0.769255 1.068017 1.420973
C  -1.923307 2.471389 -0.643622
C  -2.152694 1.100631 1.285571
C  -5.021342 1.051844 1.121425
C  -4.614918 1.233622 -1.31977
C  -4.75871 3.293457 0.090603
H  1.773106 -0.869681 1.401021
H  0.700104 -0.929592 0.011263
H  3.30734 0.637055 0.062085
H  3.734951 -2.232986 1.398566
H  4.350447 -1.155312 0.153053
H  0.719646 -3.05951 -0.496621
H  1.56664 -3.383922 1.011458
H  4.760439 -3.029047 -1.36688
H  5.555466 -3.300693 0.173633
H  1.806907 -5.280097 -0.50271
H  2.42893 -4.256314 -1.784886
H  4.336669 -5.35805 -0.675195
H  3.771522 -4.821619 0.89715
H  1.993296 2.61485 0.343528
H  1.825762 1.52725 1.705638
H  2.334859 1.748259 -1.966755
H  1.026485 0.567648 -1.970069
H  2.685166 0.047879 -2.229835
H  0.068673 2.9819 -1.217675
H  -0.335336 0.514451 2.246004
H  -2.34761 3.037029 -1.464703
H  -2.748476 0.568369 2.014867
H  -4.84457 1.449889 2.12229
H  -6.095214 1.104634 0.935078
H  -4.743916 -0.003814 1.124787
H  -4.156517 1.789109 -2.13913
H  -4.27656 0.197996 -1.38891
H  -5.694873 1.242347 -1.481773
H  -4.293568 3.904098 -0.684398
H  -5.839125 3.338845 -0.062058
H  -4.539936 3.755314 1.055232
elementType: N C H
totalener: -797.53182478 hartree
nucrepener: 1575.73072952 hartree
electener: -2373.26255431 hartree
oneelecener: -4206.94385694 hartree
twoeener: 1833.68130263 hartree
cpcmener: -0.01324580 hartree
kineticenergy: 793.51885313 hartree
xcener: -82.789626297220 hartree
chargesum: 0.0000000
charge: -0.199641 -0.199865 0.169290 -0.108005 -0.112255 -0.146372 -0.134292 -0.101960 -0.142375 -0.350786 0.056767 0.338415 -0.131496 -0.279288 -0.227738 -0.168118 -0.152224 -0.359452 -0.330571 -0.329856 0.090753 0.098316 0.048124 0.075533 0.093729 0.083666 0.072917 0.059955 0.073665 0.074148 0.056905 0.072072 0.065992 0.101861 0.097460 0.099564 0.086410 0.090130 0.146978 0.139999 0.143297 0.146539 0.100936 0.100282 0.100351 0.096591 0.101823 0.096474 0.097262 0.096974 0.101116
qa: -0.1996 -0.1999 0.1693 -0.1080 -0.1123 -0.1464 -0.1343 -0.1020 -0.1424 -0.3508 0.0568 0.3384 -0.1315 -0.2793 -0.2277 -0.1681 -0.1522 -0.3595 -0.3306 -0.3299 0.0908 0.0983 0.0481 0.0755 0.0937 0.0837 0.0729 0.0600 0.0737 0.0741 0.0569 0.0721 0.0660 0.1019 0.0975 0.0996 0.0864 0.0901 0.1470 0.1400 0.1433 0.1465 0.1009 0.1003 0.1004 0.0966 0.1018 0.0965 0.0973 0.0970 0.1011
va: 2.8745 4.0085 3.6518 3.9064 3.9431 3.9381 3.9157 3.8374 3.8617 3.9499 3.5224 3.6174 3.7559 3.9974 3.9824 3.9801 3.8974 3.9273 3.9174 3.9161 1.0132 0.9893 1.0243 1.0139 1.0065 1.0067 1.0078 1.0191 1.0145 1.0142 1.0222 1.0140 1.0161 1.0043 1.0071 1.0037 0.9961 1.0288 0.9994 1.0064 1.0011 0.9972 1.0009 1.0068 1.0009 1.0042 1.0035 1.0036 1.0042 1.0034 1.0035
dispcorr: -0.023726067 hartree
energy: -797.555550850991
dipole: -1.01238 1.02921 0.01683 -6.06948 5.94714 -0.12234 -2.48722 2.83386 0.34664
magnitude: 0.36798 au
magnitude: 0.93534 debye
